{"text_format":"1","workbook":"xlsx","n_sheets":21,"sheets":["Instructions","Scorecard (Homes)","Scorecard (Midrise)","Batch - Multifamily","Multifamily HSA","Batch - Single Family","IP","LT","SS","WE","EA","EA Lowrise","EA Midrise","MR","EQ","IN","RP","Water Reduction Calculator","Sampling Reporting Form","MRc Construction Waste Mgmt","Scorecard Data"],"not_rendered":{"charts":0,"images":10,"macros":1,"external_links":4,"defined_names":733,"comments":13,"pivot_tables":0},"unopened":[],"bounds":{"document_bytes":16777216,"sheet_cells":100000,"rows_first":2000,"rows_last":500,"rows_between":2000,"halvings":0,"cell_chars":16384,"cell_head_chars":4096},"cells_cut":0,"cells_raw":0,"read":"whole","date_system":"1900"}

{"sheet":"Instructions","index":0,"n_rows":179,"n_cols":25,"rows_kept":179,"cut":false,"hidden":false,"merged":[[119,8,119,10],[2,4,2,5],[73,4,73,5],[117,8,117,10],[118,8,118,10],[112,8,112,10],[113,8,113,10],[114,8,114,10],[115,8,115,10],[116,8,116,10],[77,2,77,5],[78,2,78,5]]}
[]
[]
[null,null,null,null,"LEED v4.1 Residential: Single Family"]
[null,null,null,null,"Step 1."]
[null,null,null,null,"Ensure this project is registered in LEED Online."]
[]
[null,null,null,null,"Step 2."]
[null,null,null,null,"Enable macros"]
[null,null,null,null,"Note: This workbook is for use with Excel for Mac 2011 and Excel 2007 or later."]
[]
[null,null,null,null,"Step 3."]
[null,null,null,null,"Unit of measure"]
[]
[null,null,null,null,"Step 4."]
[null,null,null,null,"Project rating system","LEED BD+C: Homes  v4.1 - LEED v4"]
[]
[null,null,null,null,"Project rating system","LEED v4.1 Residential: Single Family"]
[]
[null,null,null,null,"Project type"]
[]
[null,null,null,null,"Market Classification"]
[]
[null,null,null,null,"Total homes in submittal"]
[]
[null,null,null,null,"Construction type"]
[]
[null,null,null,null,"Subdivision/Development Name"]
[]
[null,null,null,null,"Project team leader name"]
[]
[null,null,null,null,"Project team leader organization name"]
[]
[null,null,null,null,"Builder (if different than team leader org)"]
[]
[null,null,null,null,"Project team leader Email address"]
[]
[null,null,null,null,"Provider Organization name"]
[]
[null,null,null,null,"Green rater"]
[]
[null,null,null,null,"Green rater"]
[]
[null,null,null,null,"Energy Rater"]
[]
[null,null,null,null,"Provider QAD"]
[]
[null,null,null,null,"Mid-construction visit date(s)"]
[null,null,null,null,null,"ex: 1/1/2015, 2/27/2015"]
[null,null,null,null,"Date final visit completed"]
[null,null,null,null,null,"ex: 3/31/2016"]
[]
[null,null,null,null,"Step 5."]
[null,null,null,null,"The following information must be consistent with project details in LEED Online:"]
[]
[null,null,null,null,"Individual Project Information"]
[null,null,null,null,"Project ID #"]
[null,null,null,null,"Project name"]
[null,null,null,null,"Project address"]
[null,null,null,null,"City"]
[null,null,null,null,"State"]
[null,null,null,null,"Country"]
[null,null,null,null,"Zip Code"]
[null,null,null,null,"Building type"]
[null,null,null,null,"Number of stories"]
[null,null,null,null,"Number of bedrooms"]
[null,null,null,null,{"$f":"CONCATENATE(\"Adjusted conditioned floor area used for LEED (see comment) \",IF(I85=2,\"(sq m)\",\"(sq ft)\"))","v":"Adjusted conditioned floor area used for LEED (see comment) (sq ft)"}]
[null,null,null,null,{"$f":"CONCATENATE(\"Conditioned floor area removed from the total due to the ENERGY STAR basement exclusion, where applicable \",IF(I85=2,\"(sq m)\",\"(sq ft)\"))","v":"Conditioned floor area removed from the total due to the ENERGY STAR basement exclusion, where applicable (sq ft)"}]
[null,null,null,null,{"$f":"CONCATENATE(\"Total conditioned floor area \",IF(I85=2,\"(sq m)\",\"(sq ft)\"))","v":"Total conditioned floor area (sq ft)"},{"$f":"IF(F66=\"\",\"\",F66+F67)","v":""}]
[null,null,null,null,"Batch Project Information"]
[null,null,null,null,"Registration Set ID #"]
[null,null,null,null,"Batch/development name"]
[null,null,null,null,"Country"]
[null,null,null,null,"Building type"]
[null,null,null,null,"Note: Go to the appropriate batch tab to document individual project IDs and address information."]
[]
[]
[null,null,"Additional Resources"]
[null,null,"- Resources & Tools section of the Homes Guide to Certification (http://www.usgbc.org/cert-guide/homes#tools)"]
[null,null,"- For changes made to this version of the Workbook, see the Form Updates section of the Addenda Database (https://www.usgbc.org/leedaddenda/5000080)"]
[]
[]
[null,null,null,null,null,null,"v05"]
[null,null,null,null,null,null,"Copyright © 2012"]
[null,null,null,null,null,null,"U.S. Green Building Council",null,"UOM","RS"]
[null,null,null,null,null,null,"All Rights Reserved",null,{"$f":"IF(F12=\"SI units\",2,1)","v":1},{"$f":"IF(F15=\"LEED BD+C: Multifamily Midrise v4 - LEED v4\",2,1)","v":1}]
[null,null,null,null,null,null,"Updated 6/18/2020",null,"IP = 1; SI = 2","H = 1; M = 2"]
[]
[null,null,null,null,null,null,null,null,"Nominal Pipe Size\n(in)","no Circ Loop\n(ft)","Circ Loop\n(ft)","EA H pts","EA M pts"]
[null,null,null,null,null,null,null,null,0.25,50,16,0,0]
[null,null,null,null,null,null,null,null,0.3125,50,16,1,1]
[null,null,null,null,null,null,null,null,0.375,50,16,2,2]
[null,null,null,null,null,null,null,null,0.5,43,16,3,3]
[null,null,null,null,null,null,null,null,0.625,32,12,4,4]
[null,null,null,null,null,null,null,null,0.75,21,8,5,5]
[null,null,null,null,null,null,null,null,0.875,16,6,6,6]
[null,null,null,null,null,null,null,null,1,13,5,7,7]
[null,null,null,null,null,null,null,null,1.25,8,3,8,8]
[null,null,null,null,null,null,null,null,1.5,6,2,9,9]
[null,null,null,null,null,null,null,null,"2 or larger",4,1,10,10]
[null,null,null,null,null,null,null,null,"Nominal Pipe Size\n(mm)","no Circ Loop\n(m)","Circ Loop\n(m)",11,11]
[null,null,null,null,null,null,null,null,6,15,5,12,12]
[null,null,null,null,null,null,null,null,8,15,5,13,13]
[null,null,null,null,null,null,null,null,9,15,5,14,14]
[null,null,null,null,null,null,null,null,13,13,5,15,15]
[null,null,null,null,null,null,null,null,16,10,4,16,16]
[null,null,null,null,null,null,null,null,19,6,2,17,17]
[null,null,null,null,null,null,null,null,22,5,2,18,18]
[null,null,null,null,null,null,null,null,25,4,2,19,19]
[null,null,null,null,null,null,null,null,32,2,1,20,20,null,null,null,null,null,null,null,null,null,null,null,{"$f":"(F58&\", \"&F59&\", \"&F60&\" \"&F62&\", \"&F61)","v":", ,  , "}]
[null,null,null,null,null,null,null,null,38,2,1,21,21]
[null,null,null,null,null,null,null,null,"50 or larger",1,0.3,22,22]
[null,null,null,null,null,null,null,null,null,null,null,23,23]
[null,null,null,null,null,null,null,null,"MR drop-down",null,null,24,24]
[null,null,null,null,null,null,null,null,"At least 25% reclaimed",null,null,25,25]
[null,null,null,null,null,null,null,null,"At least 25% postconsumer or 50% preconsumer recycled content",null,null,26,26]
[null,null,null,null,null,null,null,null,"FSC Certified wood",null,null,27,27]
[null,null,null,null,null,null,null,null,"Sustainable Agriculture Standard",null,null,28,28]
[null,null,null,null,null,null,null,null,"Concrete with at least 30% fly ash/slag and 50% recycled content aggregate OR 90% recycled content aggregate",null,null,29,29]
[null,null,null,null,null,null,null,null,"Extended producer responsibility",null,null,null,30]
[null,null,null,null,null,null,null,null,"Drywall",null,null,"MRc2 H pts","MR M pts"]
[null,null,null,null,null,null,null,null,"For synthetic, 95% recycled content (pre-, post-, or combination)",null,null,0,0]
[null,null,null,null,null,null,null,null,"For non-synthetic, 10% post-consumer recycled content",null,null,0.5,0.5]
[null,null,null,null,null,null,null,null,null,null,null,1,1]
[null,null,null,null,null,null,null,null,"% reduction","pts",null,1.5,1.5]
[null,null,null,null,null,null,null,null,0.01,1,null,2,2]
[null,null,null,null,null,null,null,null,0.02,2,null,2.5,2.5]
[null,null,null,null,null,null,null,null,0.03,3,null,3,3]
[null,null,null,null,null,null,null,null,0.04,4,null,3.5,3.5]
[null,null,null,null,null,null,null,null,0.05,5,null,4,4]
[null,null,null,null,null,null,null,null,0.06,6,null,null,4.5]
[null,null,null,null,null,null,null,null,7.0000000000000007E-2,7,null,null,5]
[null,null,null,null,null,null,null,null,0.08,8,null,"EQc4 H pts","EQ M pts"]
[null,null,null,null,null,null,null,null,0.09,9,null,0,0]
[null,null,null,null,null,null,null,null,0.1,10,null,1,1]
[null,null,null,null,null,null,null,null,0.12,11,null,null,2]
[null,null,null,null,null,null,null,null,0.14000000000000001,12,null,null,3]
[null,null,null,null,null,null,null,null,0.16,13]
[null,null,null,null,null,null,null,null,0.18,14]
[null,null,null,null,null,null,null,null,0.2,15]
[null,null,null,null,null,null,null,null,0.22,16]
[null,null,null,null,null,null,null,null,0.24,17]
[null,null,null,null,null,null,null,null,0.26,18]
[null,null,null,null,null,null,null,null,0.28000000000000003,19]
[null,null,null,null,null,null,null,null,0.3,20]
[null,null,null,null,null,null,null,null,0.32,21]
[null,null,null,null,null,null,null,null,0.34,22]
[null,null,null,null,null,null,null,null,0.37,23]
[null,null,null,null,null,null,null,null,0.4,24]
[null,null,null,null,null,null,null,null,0.5,25]
[null,null,null,null,null,null,null,null,0.6,26]
[null,null,null,null,null,null,null,null,0.7,27]
[null,null,null,null,null,null,null,null,0.8,28]
[null,null,null,null,null,null,null,null,0.9,29]
[null,null,null,null,null,null,null,null,"HERS","pts"]
[null,null,null,null,null,null,null,null,70,5]
[null,null,null,null,null,null,null,null,69,6]
[null,null,null,null,null,null,null,null,68,7]
[null,null,null,null,null,null,null,null,67,8]
[null,null,null,null,null,null,null,null,66,9]
[null,null,null,null,null,null,null,null,65,10]
[null,null,null,null,null,null,null,null,64,11]
[null,null,null,null,null,null,null,null,63,12]
[null,null,null,null,null,null,null,null,62,13]
[null,null,null,null,null,null,null,null,60,14]
[null,null,null,null,null,null,null,null,58,15]
[null,null,null,null,null,null,null,null,56,16]
[null,null,null,null,null,null,null,null,54,17]
[null,null,null,null,null,null,null,null,52,18]
[null,null,null,null,null,null,null,null,50,19]
[null,null,null,null,null,null,null,null,45,20]
[null,null,null,null,null,null,null,null,40,21]
[null,null,null,null,null,null,null,null,35,22]
[null,null,null,null,null,null,null,null,30,23]
[null,null,null,null,null,null,null,null,25,24]
[null,null,null,null,null,null,null,null,20,25]
[null,null,null,null,null,null,null,null,15,26]
[null,null,null,null,null,null,null,null,10,27]
[null,null,null,null,null,null,null,null,5,28]
[null,null,null,null,null,null,null,null,0,29]

{"sheet":"Scorecard (Homes)","index":1,"n_rows":104,"n_cols":12,"rows_kept":104,"cut":false,"hidden":false,"merged":[[103,1,103,9],[15,11,16,11],[35,11,36,11],[46,11,47,11]]}
[]
[null,"LEED v4.1 Residential: Single Family"]
[null,{"$f":"CONCATENATE(IF(Type=\"Batch\",Instructions!F71,Instructions!F57),\" Scorecard\",\" (ID: \",IF(Type=\"Batch\",Instructions!F70,Instructions!F56),\")\")","v":" Scorecard (ID: )"}]
[null,"Project Address",{"$f":"CONCATENATE(IF(Type=\"Batch\",Instructions!F72,Instructions!Y109))","v":", ,  , "}]
[null,{"$f":"IF(Instructions!F19=\"Batch\",\"***Please see 'Batch - Single Family' tab for address information\",\"\")","v":""}]
[null,"Note: The information on this tab is READ-ONLY.  To edit this information, see the Credit Category tabs."]
[]
[null,null,"Integrative Process",null,"Preliminary    Y",{"$f":"IP!F3","v":0},"M",{"$f":"IP!H3","v":0},"Verified",{"$f":"IP!J3","v":0}]
[]
[null,null,"IPc","Integrative Process",null,{"$f":"IP!$F$7","v":0},null,{"$f":"IP!$H$7","v":0},null,{"$f":"IF(IP!$J$7=0,\"\",IP!$J$7)","v":""}]
[]
[null,null,"Location and Transportation",null,"Preliminary    Y",{"$f":"LT!F3","v":0},"M",{"$f":"LT!H3","v":0},"Verified",{"$f":"LT!J3","v":0}]
[]
[null,null,"LTp","Floodplain Avoidance",null,"Required",null,null,null,{"$f":"IF(LT!$J$7=\"Y\",\"Verified\",\"Not Verified\")","v":"Not Verified"}]
[null,null,"Performance Path"]
[null,null,"LTc","LEED for Neighborhood Development",null,{"$f":"LT!$F$19","v":0},null,{"$f":"LT!$H$19","v":0},null,{"$f":"IF(LT!$J$19=0,\"\",LT!$J$19)","v":""},null,{"$f":"IF(AND(J16<>\"\",SUM(J18:J21)>0),\"Warning: The project cannot receive points under the Performance Path if also receiving points under the Prescriptive Path.\",\"\")","v":""}]
[null,null,"Prescriptive Path"]
[null,null,"LTc","Site Selection",null,{"$f":"LT!$F$32","v":0},null,{"$f":"LT!$H$32","v":0},null,{"$f":"IF(LT!$J$32=0,\"\",LT!$J$32)","v":""}]
[null,null,"LTc","Compact Development",null,{"$f":"LT!$F$111","v":0},null,{"$f":"LT!$H$111","v":0},null,{"$f":"IF(LT!$J$111=0,\"\",LT!$J$111)","v":""}]
[null,null,"LTc","Community Resources",null,{"$f":"LT!$F$122","v":0},null,{"$f":"LT!$H$122","v":0},null,{"$f":"IF(LT!$J$122=0,\"\",LT!$J$122)","v":""}]
[null,null,"LTc","Access to Transit",null,{"$f":"LT!$F$130","v":0},null,{"$f":"LT!$H$130","v":0},null,{"$f":"IF(LT!$J$130=0,\"\",LT!$J$130)","v":""}]
[]
[null,null,"Sustainable Sites",null,"Preliminary    Y",{"$f":"SS!F3","v":0},"M",{"$f":"SS!H3","v":0},"Verified",{"$f":"SS!J3","v":0}]
[]
[null,null,"SSp","Construction Activity Pollution Prevention",null,"Required",null,null,null,{"$f":"IF(SS!$J$7=\"Y\",\"Verified\",\"Not Verified\")","v":"Not Verified"}]
[null,null,"SSp","No Invasive Plants",null,"Required",null,null,null,{"$f":"IF(SS!#REF!=\"Y\",\"Verified\",\"Not Verified\")","v":{"$error":"#REF!"}}]
[null,null,"SSc","Heat Island Reduction",null,{"$f":"SS!$F$34","v":0},null,{"$f":"SS!$H$34","v":0},null,{"$f":"IF(SS!$J$34=0,\"\",SS!$J$34)","v":""}]
[null,null,"SSc","Rainwater Management",null,{"$f":"SS!$F$66","v":0},null,{"$f":"SS!$H$66","v":0},null,{"$f":"IF(SS!$J$66=0,\"\",SS!$J$66)","v":""}]
[null,null,"SSc","Nontoxic Pest Control",null,{"$f":"SS!$F$122","v":0},null,{"$f":"SS!$H$122","v":0},null,{"$f":"IF(SS!$J$122=0,\"\",SS!$J$122)","v":""}]
[]
[null,null,"Water Efficiency ",null,"Preliminary    Y",{"$f":"WE!F3","v":0},"M",{"$f":"WE!H3","v":0},"Verified",{"$f":"WE!J3","v":0}]
[]
[null,null,"WEp","Water Use",null,"Required",null,null,null,{"$f":"IF(WE!$J$7=\"Y\",\"Verified\",\"Not Verified\")","v":"Not Verified"}]
[null,null,"WEp","Water Metering",null,"Required",null,null,null,{"$f":"IF(WE!$J$23=\"Y\",\"Verified\",\"Not Verified\")","v":"Not Verified"}]
[null,null,"Performance Path"]
[null,null,"WEc","Total Water Use",null,{"$f":"WE!$F$32","v":0},null,{"$f":"WE!$H$32","v":0},null,{"$f":"IF(WE!$J$32=0,\"\",WE!$J$32)","v":""},null,{"$f":"IF(AND(J36<>\"\",SUM(J38:J39)>0),\"Warning: The project cannot receive points under the Performance Path if also receiving points under the Prescriptive Path.\",\"\")","v":""}]
[null,null,"Prescriptive Path"]
[null,null,"WEc","Indoor Water Use",null,{"$f":"WE!$F$43","v":0},null,{"$f":"WE!$H$43","v":0},null,{"$f":"IF(WE!$J$43=0,\"\",WE!$J$43)","v":""}]
[null,null,"WEc","Outdoor Water Use",null,{"$f":"WE!$F$65","v":0},null,{"$f":"WE!$H$65","v":0},null,{"$f":"IF(WE!$J$65=0,\"\",WE!$J$65)","v":""}]
[]
[null,null,"Energy and Atmosphere",null,"Preliminary    Y",{"$f":"EA!F3","v":0},"M",{"$f":"EA!H3","v":0},"Verified",{"$f":"EA!J3","v":0}]
[]
[null,null,"EAp","Minimum Energy Performance ",null,"Required",null,null,null,{"$f":"IF(EA!$J$7=\"Y\",\"Verified\",\"Not Verified\")","v":"Not Verified"}]
[null,null,"EAp","Energy Metering",null,"Required",null,null,null,{"$f":"IF(EA!$J$30=\"Y\",\"Verified\",\"Not Verified\")","v":"Not Verified"}]
[null,null,"EAp","Education of the Homeowner, Tenant or Building Manager",null,"Required",null,null,null,{"$f":"IF(EA!$J$39=\"Y\",\"Verified\",\"Not Verified\")","v":"Not Verified"}]
[null,null,"Performance Path"]
[null,null,"EAc","Annual Energy Use",null,{"$f":"EA!$F$48","v":0},null,{"$f":"EA!$H$48","v":0},null,{"$f":"IF(EA!$J$48=0,\"\",EA!$J$48)","v":""}]
[null,null,"Performance and Prescriptive Paths"]
[null,null,"EAc","Efficient Hot Water Distribution System",null,{"$f":"EA!$F$86","v":0},null,{"$f":"EA!$H$86","v":0},null,{"$f":"IF(EA!$J$86=0,\"\",EA!$J$86)","v":""}]
[null,null,"EAc","Advanced Utility Tracking",null,{"$f":"EA!#REF!","v":{"$error":"#REF!"}},null,{"$f":"EA!#REF!","v":{"$error":"#REF!"}},null,{"$f":"IF(EA!#REF!=0,\"\",EA!#REF!)","v":{"$error":"#REF!"}}]
[null,null,"EAc","Active Solar-Ready Design",null,{"$f":"EA!#REF!","v":{"$error":"#REF!"}},null,{"$f":"EA!#REF!","v":{"$error":"#REF!"}},null,{"$f":"IF(EA!#REF!=0,\"\",EA!#REF!)","v":{"$error":"#REF!"}}]
[null,null,"EAc","HVAC Start-Up Credentialing",null,{"$f":"EA!$F$166","v":0},null,{"$f":"EA!$H$166","v":0},null,{"$f":"IF(EA!$J$166=0,\"\",EA!$J$166)","v":""}]
[null,null,"Prescriptive Path"]
[null,null,"EAp","Home Size",null,{"$f":"IF(EA!#REF!=0,\"Required\",EA!#REF!)","v":{"$error":"#REF!"}},null,{"$f":"IF(F54=\"Required\",\"\",EA!#REF!)","v":{"$error":"#REF!"}},null,{"$f":"IF(EAp4V=0,\"Not Verified\",EAp4V)","v":{"$error":"#REF!"}}]
[null,null,"EAc","Building Orientation for Passive Solar",null,{"$f":"EA!#REF!","v":{"$error":"#REF!"}},null,{"$f":"EA!#REF!","v":{"$error":"#REF!"}},null,{"$f":"IF(EA!#REF!=0,\"\",EA!#REF!)","v":{"$error":"#REF!"}}]
[null,null,"EAc","Air Infiltration",null,{"$f":"EA!#REF!","v":{"$error":"#REF!"}},null,{"$f":"EA!#REF!","v":{"$error":"#REF!"}},null,{"$f":"IF(EA!#REF!=0,\"\",EA!#REF!)","v":{"$error":"#REF!"}}]
[null,null,"EAc","Envelope Insulation",null,{"$f":"EA!#REF!","v":{"$error":"#REF!"}},null,{"$f":"EA!#REF!","v":{"$error":"#REF!"}},null,{"$f":"IF(EA!#REF!=0,\"\",EA!#REF!)","v":{"$error":"#REF!"}}]
[null,null,"EAc","Windows",null,{"$f":"EA!#REF!","v":{"$error":"#REF!"}},null,{"$f":"EA!#REF!","v":{"$error":"#REF!"}},null,{"$f":"IF(EA!#REF!=0,\"\",EA!#REF!)","v":{"$error":"#REF!"}}]
[null,null,"EAc","Space Heating & Cooling Equipment",null,{"$f":"EA!#REF!","v":{"$error":"#REF!"}},null,{"$f":"EA!#REF!","v":{"$error":"#REF!"}},null,{"$f":"IF(EA!#REF!=0,\"\",EA!#REF!)","v":{"$error":"#REF!"}}]
[null,null,"EAc","Refrigerant Management",null,{"$f":"EA!$F$178","v":0},null,{"$f":"EA!$H$178","v":0},null,{"$f":"IF(EA!$J$178=0,\"\",EA!$J$178)","v":""}]
[null,null,"EAc","Heating & Cooling Distribution Systems",null,{"$f":"EA!#REF!","v":{"$error":"#REF!"}},null,{"$f":"EA!#REF!","v":{"$error":"#REF!"}},null,{"$f":"IF(EA!#REF!=0,\"\",EA!#REF!)","v":{"$error":"#REF!"}}]
[null,null,"EAc","Efficient Domestic Hot Water Equipment",null,{"$f":"EA!#REF!","v":{"$error":"#REF!"}},null,{"$f":"EA!#REF!","v":{"$error":"#REF!"}},null,{"$f":"IF(EA!#REF!=0,\"\",EA!#REF!)","v":{"$error":"#REF!"}}]
[null,null,"EAc","Lighting",null,{"$f":"EA!#REF!","v":{"$error":"#REF!"}},null,{"$f":"EA!#REF!","v":{"$error":"#REF!"}},null,{"$f":"IF(EA!#REF!=0,\"\",EA!#REF!)","v":{"$error":"#REF!"}}]
[null,null,"EAc","High-Efficiency Appliances",null,{"$f":"EA!#REF!","v":{"$error":"#REF!"}},null,{"$f":"EA!#REF!","v":{"$error":"#REF!"}},null,{"$f":"IF(EA!#REF!=0,\"\",EA!#REF!)","v":{"$error":"#REF!"}}]
[null,null,"EAc","Renewable Energy",null,{"$f":"EA!#REF!","v":{"$error":"#REF!"}},null,{"$f":"EA!#REF!","v":{"$error":"#REF!"}},null,{"$f":"IF(EA!#REF!=0,\"\",EA!#REF!)","v":{"$error":"#REF!"}}]
[]
[null,null,"Materials and Resources",null,"Preliminary    Y",{"$f":"MR!F3","v":0},"M",{"$f":"MR!H3","v":0},"Verified",{"$f":"MR!J3","v":0}]
[]
[null,null,"MRp","Certified Tropical Wood",null,"Required",null,null,null,{"$f":"IF(MR!$J$7=\"Y\",\"Verified\",\"Not Verified\")","v":"Not Verified"}]
[null,null,"MRp","Durability Management",null,"Required",null,null,null,{"$f":"IF(MR!$J$14=\"Y\",\"Verified\",\"Not Verified\")","v":"Not Verified"}]
[null,null,"MRc","Durability Management Verification",null,{"$f":"MR!$F$39","v":0},null,{"$f":"MR!$H$39","v":0},null,{"$f":"IF(MR!$J$39=0,\"\",MR!$J$39)","v":""}]
[null,null,"MRc","Environmentally Preferable Products",null,{"$f":"MR!$F$66","v":0},null,{"$f":"MR!$H$66","v":0},null,{"$f":"IF(MR!$J$66=0,\"\",MR!$J$66)","v":""}]
[null,null,"MRc","Construction Waste Management",null,{"$f":"MR!$F$118","v":0},null,{"$f":"MR!$H$118","v":0},null,{"$f":"IF(MR!$J$118=0,\"\",MR!$J$118)","v":""}]
[null,null,"MRc","Material-Efficient Framing",null,{"$f":"MR!$F$151","v":0},null,{"$f":"MR!$H$151","v":0},null,{"$f":"IF(MR!$J$151=0,\"\",MR!$J$151)","v":""}]
[]
[null,null,"Indoor Environmental Quality",null,"Preliminary    Y",{"$f":"EQ!F3","v":0},"M",{"$f":"EQ!H3","v":0},"Verified",{"$f":"EQ!J3","v":0}]
[]
[null,null,"EQp","Ventilation",null,"Required",null,null,null,{"$f":"IF(EQ!$J$7=\"Y\",\"Verified\",\"Not Verified\")","v":"Not Verified"}]
[null,null,"EQp","Combustion Venting",null,"Required",null,null,null,{"$f":"IF(EQ!$J$32=\"Y\",\"Verified\",\"Not Verified\")","v":"Not Verified"}]
[null,null,"EQp","Garage Pollutant Protection",null,"Required",null,null,null,{"$f":"IF(EQ!$J$53=\"Y\",\"Verified\",\"Not Verified\")","v":"Not Verified"}]
[null,null,"EQp","Radon-Resistant Construction",null,"Required",null,null,null,{"$f":"IF(EQ!$J$73=\"Y\",\"Verified\",\"Not Verified\")","v":"Not Verified"}]
[null,null,"EQp","Air Filtering",null,"Required",null,null,null,{"$f":"IF(EQ!$J$109=\"Y\",\"Verified\",\"Not Verified\")","v":"Not Verified"}]
[null,null,"EQp","Environmental Tobacco Smoke",null,"Required",null,null,null,{"$f":"IF(EQ!#REF!=\"Y\",\"Verified\",\"Not Verified\")","v":{"$error":"#REF!"}}]
[null,null,"EQp","Compartmentalization",null,"Required",null,null,null,{"$f":"IF(EQ!$J$119=\"Y\",\"Verified\",\"Not Verified\")","v":"Not Verified"}]
[null,null,"EQc","Enhanced Ventilation",null,{"$f":"EQ!$F$135","v":0},null,{"$f":"EQ!$H$135","v":0},null,{"$f":"IF(EQ!$J$135=0,\"\",EQ!$J$135)","v":""}]
[null,null,"EQc","Contaminant Control",null,{"$f":"EQ!$F$160","v":0},null,{"$f":"EQ!$H$160","v":0},null,{"$f":"IF(EQ!$J$160=0,\"\",EQ!$J$160)","v":""}]
[null,null,"EQc","Balancing of Heating and Cooling Distribution Systems",null,{"$f":"EQ!$F$256","v":0},null,{"$f":"EQ!$H$256","v":0},null,{"$f":"IF(EQ!$J$256=0,\"\",EQ!$J$256)","v":""}]
[null,null,"EQc","Enhanced Compartmentalization",null,{"$f":"EQ!#REF!","v":{"$error":"#REF!"}},null,{"$f":"EQ!#REF!","v":{"$error":"#REF!"}},null,{"$f":"IF(EQ!#REF!=0,\"\",EQ!#REF!)","v":{"$error":"#REF!"}}]
[null,null,"EQc","Combustion Venting",null,{"$f":"EQ!#REF!","v":{"$error":"#REF!"}},null,{"$f":"EQ!#REF!","v":{"$error":"#REF!"}},null,{"$f":"IF(EQ!#REF!=0,\"\",EQ!#REF!)","v":{"$error":"#REF!"}}]
[null,null,"EQc","Enhanced Garage Pollutant Protection",null,{"$f":"EQ!#REF!","v":{"$error":"#REF!"}},null,{"$f":"EQ!#REF!","v":{"$error":"#REF!"}},null,{"$f":"IF(EQ!#REF!=0,\"\",EQ!#REF!)","v":{"$error":"#REF!"}}]
[null,null,"EQc","Low-Emitting Products",null,{"$f":"EQ!$F$337","v":0},null,{"$f":"EQ!$H$337","v":0},null,{"$f":"IF(EQ!$J$337=0,\"\",EQ!$J$337)","v":""}]
[]
[null,null,"Innovation",null,"Preliminary    Y",{"$f":"IN!F3","v":0},"M",{"$f":"IN!H3","v":0},"Verified",{"$f":"IN!J3","v":0}]
[]
[null,null,"INp","Preliminary Rating",null,"Required",null,null,null,{"$f":"IF(IN!$J$7=\"Y\",\"Verified\",\"Not Verified\")","v":"Not Verified"}]
[null,null,"INc","Innovation  ",null,{"$f":"IN!$F$15","v":0},null,{"$f":"IN!$H$15","v":0},null,{"$f":"IF(IN!$J$15=0,\"\",IN!$J$15)","v":""}]
[null,null,"INc","LEED Accredited Professional",null,{"$f":"IN!$F$49","v":0},null,{"$f":"IN!$H$49","v":0},null,{"$f":"IF(IN!$J$49=0,\"\",IN!$J$49)","v":""}]
[]
[null,null,"Regional Priority",null,"Preliminary    Y",{"$f":"RP!F3","v":0},"M",{"$f":"RP!H3","v":0},"Verified",{"$f":"RP!J3","v":0}]
[]
[null,null,"RPc","Regional Priority",null,{"$f":"RP!$F$7","v":0},null,{"$f":"RP!$H$7","v":0},null,{"$f":"IF(RP!$J$7=0,\"\",RP!$J$7)","v":""}]
[]
[null,"Total",null,null,"Preliminary    Y",{"$f":"SUM(F99,F93,F76,F67,F41,F31,F23,F12,F8)","v":0},"M",{"$f":"SUM(H99,H93,H76,H67,H41,H31,H23,H12,H8)","v":0},"Verified",{"$f":"SUM(J99,J93,J76,J67,J41,J31,J23,J12,J8)","v":0}]
[null,"Certification Thresholds      Certified: 40-49, Silver: 50-59, Gold: 60-79, Platinum: 80-110"]

{"sheet":"Scorecard (Midrise)","index":2,"n_rows":93,"n_cols":12,"rows_kept":93,"cut":false,"hidden":true,"merged":[[92,1,92,9],[14,11,15,11],[33,11,34,11]]}
[]
[null,"LEED BD+C: Multifamily Midrise v4 - LEED v4"]
[null,{"$f":"CONCATENATE(IF(Type=\"Batch\",Instructions!F71,Instructions!F57),\" Scorecard\")","v":" Scorecard"}]
[null,"Location:",{"$f":"CONCATENATE(IF(Type=\"Batch\",Instructions!F72,Instructions!Y109))","v":", ,  , "}]
[null,"Note: The information on this tab is READ-ONLY.  To edit this information, see the Credit Category tabs."]
[]
[null,null,"Integrative Process",null,"Preliminary    Y",{"$f":"IP!F3","v":0},"M",{"$f":"IP!H3","v":0},"Verified",{"$f":"IP!J3","v":0}]
[]
[null,null,"IPc","Integrative Process",null,{"$f":"IP!$F$7","v":0},null,{"$f":"IP!$H$7","v":0},null,{"$f":"IF(IP!$J$7=0,\"\",IP!$J$7)","v":""}]
[]
[null,null,"Location and Transportation",null,"Preliminary    Y",{"$f":"LT!F3","v":0},"M",{"$f":"LT!H3","v":0},"Verified",{"$f":"LT!J3","v":0}]
[]
[null,null,"LTp","Floodplain Avoidance",null,"Required",null,null,null,{"$f":"IF(LT!$J$7=\"Y\",\"Verified\",\"Not Verified\")","v":"Not Verified"}]
[null,null,"Performance Path"]
[null,null,"LTc","LEED for Neighborhood Development",null,{"$f":"LT!$F$19","v":0},null,{"$f":"LT!$H$19","v":0},null,{"$f":"IF(LT!$J$19=0,\"\",LT!$J$19)","v":""},null,{"$f":"IF(AND(J15<>\"\",SUM(J17:J20)>0),\"Warning: The project cannot receive points under the Performance Path if also receiving points under the Prescriptive Path.\",\"\")","v":""}]
[null,null,"Prescriptive Path"]
[null,null,"LTc","Site Selection",null,{"$f":"LT!$F$32","v":0},null,{"$f":"LT!$H$32","v":0},null,{"$f":"IF(LT!$J$32=0,\"\",LT!$J$32)","v":""}]
[null,null,"LTc","Compact Development",null,{"$f":"LT!$F$111","v":0},null,{"$f":"LT!$H$111","v":0},null,{"$f":"IF(LT!$J$111=0,\"\",LT!$J$111)","v":""}]
[null,null,"LTc","Community Resources",null,{"$f":"LT!$F$122","v":0},null,{"$f":"LT!$H$122","v":0},null,{"$f":"IF(LT!$J$122=0,\"\",LT!$J$122)","v":""}]
[null,null,"LTc","Access to Transit",null,{"$f":"LT!$F$130","v":0},null,{"$f":"LT!$H$130","v":0},null,{"$f":"IF(LT!$J$130=0,\"\",LT!$J$130)","v":""}]
[]
[null,null,"Sustainable Sites",null,"Preliminary    Y",{"$f":"SS!F3","v":0},"M",{"$f":"SS!H3","v":0},"Verified",{"$f":"SS!J3","v":0}]
[]
[null,null,"SSp","Construction Activity Pollution Prevention",null,"Required",null,null,null,{"$f":"IF(SS!$J$7=\"Y\",\"Verified\",\"Not Verified\")","v":"Not Verified"}]
[null,null,"SSp","No Invasive Plants",null,"Required",null,null,null,{"$f":"IF(SS!#REF!=\"Y\",\"Verified\",\"Not Verified\")","v":{"$error":"#REF!"}}]
[null,null,"SSc","Heat Island Reduction",null,{"$f":"SS!$F$34","v":0},null,{"$f":"SS!$H$34","v":0},null,{"$f":"IF(SS!$J$34=0,\"\",SS!$J$34)","v":""}]
[null,null,"SSc","Rainwater Management",null,{"$f":"SS!$F$66","v":0},null,{"$f":"SS!$H$66","v":0},null,{"$f":"IF(SS!$J$66=0,\"\",SS!$J$66)","v":""}]
[null,null,"SSc","Nontoxic Pest Control",null,{"$f":"SS!$F$122","v":0},null,{"$f":"SS!$H$122","v":0},null,{"$f":"IF(SS!$J$122=0,\"\",SS!$J$122)","v":""}]
[]
[null,null,"Water Efficiency ",null,"Preliminary    Y",{"$f":"WE!F3","v":0},"M",{"$f":"WE!H3","v":0},"Verified",{"$f":"WE!J3","v":0}]
[]
[null,null,"WEp","Water Metering",null,"Required",null,null,null,{"$f":"IF(WE!$J$23=\"Y\",\"Verified\",\"Not Verified\")","v":"Not Verified"}]
[null,null,"Performance Path"]
[null,null,"WEc","Total Water Use",null,{"$f":"WE!$F$32","v":0},null,{"$f":"WE!$H$32","v":0},null,{"$f":"IF(WE!$J$32=0,\"\",WE!$J$32)","v":""},null,{"$f":"IF(AND(J34<>\"\",SUM(J36:J37)>0),\"Warning: The project cannot receive points under the Performance Path if also receiving points under the Prescriptive Path.\",\"\")","v":""}]
[null,null,"Prescriptive Path"]
[null,null,"WEc","Indoor Water Use",null,{"$f":"WE!$F$43","v":0},null,{"$f":"WE!$H$43","v":0},null,{"$f":"IF(WE!$J$43=0,\"\",WE!$J$43)","v":""}]
[null,null,"WEc","Outdoor Water Use",null,{"$f":"WE!$F$65","v":0},null,{"$f":"WE!$H$65","v":0},null,{"$f":"IF(WE!$J$65=0,\"\",WE!$J$65)","v":""}]
[]
[null,null,"Energy and Atmosphere",null,"Preliminary    Y",{"$f":"EA!F3","v":0},"M",{"$f":"EA!H3","v":0},"Verified",{"$f":"EA!J3","v":0}]
[]
[null,null,"EAp","Minimum Energy Performance ",null,"Required",null,null,null,{"$f":"IF(EA!$J$7=\"Y\",\"Verified\",\"Not Verified\")","v":"Not Verified"}]
[null,null,"EAp","Energy Metering",null,"Required",null,null,null,{"$f":"IF(EA!$J$30=\"Y\",\"Verified\",\"Not Verified\")","v":"Not Verified"}]
[null,null,"EAp","Education of the Homeowner, Tenant or Building Manager",null,"Required",null,null,null,{"$f":"IF(EA!$J$39=\"Y\",\"Verified\",\"Not Verified\")","v":"Not Verified"}]
[null,null,"EAc","Annual Energy Use",null,{"$f":"EAc1_M_Y","v":{"$error":"#REF!"}},null,{"$f":"EAc1_M_M","v":{"$error":"#REF!"}},null,{"$f":"IF(EAc1_M_V=0,\"\",EAc1_M_V)","v":{"$error":"#REF!"}}]
[null,null,"EAc","Efficient Hot Water Distribution System",null,{"$f":"EA!$F$86","v":0},null,{"$f":"EA!$H$86","v":0},null,{"$f":"IF(EA!$J$86=0,\"\",EA!$J$86)","v":""}]
[null,null,"EAc","Advanced Utility Tracking",null,{"$f":"EA!#REF!","v":{"$error":"#REF!"}},null,{"$f":"EA!#REF!","v":{"$error":"#REF!"}},null,{"$f":"IF(EA!#REF!=0,\"\",EA!#REF!)","v":{"$error":"#REF!"}}]
[]
[null,null,"Materials and Resources",null,"Preliminary    Y",{"$f":"MR!F3","v":0},"M",{"$f":"MR!H3","v":0},"Verified",{"$f":"MR!J3","v":0}]
[]
[null,null,"MRp","Certified Tropical Wood",null,"Required",null,null,null,{"$f":"IF(MR!$J$7=\"Y\",\"Verified\",\"Not Verified\")","v":"Not Verified"}]
[null,null,"MRp","Durability Management",null,"Required",null,null,null,{"$f":"IF(MR!$J$14=\"Y\",\"Verified\",\"Not Verified\")","v":"Not Verified"}]
[null,null,"MRc","Durability Management Verification",null,{"$f":"MR!$F$39","v":0},null,{"$f":"MR!$H$39","v":0},null,{"$f":"IF(MR!$J$39=0,\"\",MR!$J$39)","v":""}]
[null,null,"MRc","Environmentally Preferable Products",null,{"$f":"MR!$F$66","v":0},null,{"$f":"MR!$H$66","v":0},null,{"$f":"IF(MR!$J$66=0,\"\",MR!$J$66)","v":""}]
[null,null,"MRc","Construction Waste Management",null,{"$f":"MR!$F$118","v":0},null,{"$f":"MR!$H$118","v":0},null,{"$f":"IF(MR!$J$118=0,\"\",MR!$J$118)","v":""}]
[]
[null,null,"Indoor Environmental Quality",null,"Preliminary    Y",{"$f":"EQ!F3","v":0},"M",{"$f":"EQ!H3","v":0},"Verified",{"$f":"EQ!J3","v":0}]
[]
[null,null,"EQp","Ventilation",null,"Required",null,null,null,{"$f":"IF(EQ!$J$7=\"Y\",\"Verified\",\"Not Verified\")","v":"Not Verified"}]
[null,null,"EQp","Combustion Venting",null,"Required",null,null,null,{"$f":"IF(EQ!$J$32=\"Y\",\"Verified\",\"Not Verified\")","v":"Not Verified"}]
[null,null,"EQp","Garage Pollutant Protection",null,"Required",null,null,null,{"$f":"IF(EQ!$J$53=\"Y\",\"Verified\",\"Not Verified\")","v":"Not Verified"}]
[null,null,"EQp","Radon-Resistant Construction",null,"Required",null,null,null,{"$f":"IF(EQ!$J$73=\"Y\",\"Verified\",\"Not Verified\")","v":"Not Verified"}]
[null,null,"EQp","Air Filtering",null,"Required",null,null,null,{"$f":"IF(EQ!$J$109=\"Y\",\"Verified\",\"Not Verified\")","v":"Not Verified"}]
[null,null,"EQp","Environmental Tobacco Smoke",null,"Required",null,null,null,{"$f":"IF(EQ!#REF!=\"Y\",\"Verified\",\"Not Verified\")","v":{"$error":"#REF!"}}]
[null,null,"EQp","Compartmentalization",null,"Required",null,null,null,{"$f":"IF(EQ!$J$119=\"Y\",\"Verified\",\"Not Verified\")","v":"Not Verified"}]
[null,null,"EQc","Enhanced Ventilation",null,{"$f":"EQ!$F$135","v":0},null,{"$f":"EQ!$H$135","v":0},null,{"$f":"IF(EQ!$J$135=0,\"\",EQ!$J$135)","v":""}]
[null,null,"EQc","Contaminant Control",null,{"$f":"EQ!$F$160","v":0},null,{"$f":"EQ!$H$160","v":0},null,{"$f":"IF(EQ!$J$160=0,\"\",EQ!$J$160)","v":""}]
[null,null,"EQc","Balancing of Heating and Cooling Distribution Systems",null,{"$f":"EQ!$F$256","v":0},null,{"$f":"EQ!$H$256","v":0},null,{"$f":"IF(EQ!$J$256=0,\"\",EQ!$J$256)","v":""}]
[null,null,"EQc","Enhanced Compartmentalization",null,{"$f":"EQ!#REF!","v":{"$error":"#REF!"}},null,{"$f":"EQ!#REF!","v":{"$error":"#REF!"}},null,{"$f":"IF(EQ!#REF!=0,\"\",EQ!#REF!)","v":{"$error":"#REF!"}}]
[null,null,"EQc","Combustion Venting",null,{"$f":"EQ!#REF!","v":{"$error":"#REF!"}},null,{"$f":"EQ!#REF!","v":{"$error":"#REF!"}},null,{"$f":"IF(EQ!#REF!=0,\"\",EQ!#REF!)","v":{"$error":"#REF!"}}]
[null,null,"EQc","Enhanced Garage Pollutant Protection",null,{"$f":"EQ!#REF!","v":{"$error":"#REF!"}},null,{"$f":"EQ!#REF!","v":{"$error":"#REF!"}},null,{"$f":"IF(EQ!#REF!=0,\"\",EQ!#REF!)","v":{"$error":"#REF!"}}]
[null,null,"EQc","Low-Emitting Products",null,{"$f":"EQ!$F$337","v":0},null,{"$f":"EQ!$H$337","v":0},null,{"$f":"IF(EQ!$J$337=0,\"\",EQ!$J$337)","v":""}]
[null,null,"EQc","No Environmental Tobacco Smoke",null,{"$f":"EQ!#REF!","v":{"$error":"#REF!"}},null,{"$f":"EQ!#REF!","v":{"$error":"#REF!"}},null,{"$f":"IF(EQ!#REF!=0,\"\",EQ!#REF!)","v":{"$error":"#REF!"}}]
[]
[null,null,"Innovation",null,"Preliminary    Y",{"$f":"IN!F3","v":0},"M",{"$f":"IN!H3","v":0},"Verified",{"$f":"IN!J3","v":0}]
[]
[null,null,"INp","Preliminary Rating",null,"Required",null,null,null,{"$f":"IF(IN!$J$7=\"Y\",\"Verified\",\"Not Verified\")","v":"Not Verified"}]
[null,null,"INc","Innovation  ",null,{"$f":"IN!$F$15","v":0},null,{"$f":"IN!$H$15","v":0},null,{"$f":"IF(IN!$J$15=0,\"\",IN!$J$15)","v":""}]
[null,null,"INc","LEED Accredited Professional",null,{"$f":"IN!$F$49","v":0},null,{"$f":"IN!$H$49","v":0},null,{"$f":"IF(IN!$J$49=0,\"\",IN!$J$49)","v":""}]
[]
[null,null,"Regional Priority",null,"Preliminary    Y",{"$f":"RP!F3","v":0},"M",{"$f":"RP!H3","v":0},"Verified",{"$f":"RP!J3","v":0}]
[]
[null,null,"RPc","Regional Priority",null,{"$f":"RP!$F$7","v":0},null,{"$f":"RP!$H$7","v":0},null,{"$f":"IF(RP!$J$7=0,\"\",RP!$J$7)","v":""}]
[]
[null,"Point Floors"]
[]
[null,"The project earned at least 8 points total in Location and Transportation and Energy and Atmosphere",null,null,null,null,null,null,null,{"$f":"IF(J11+J39>=8,\"Yes\",\"No\")","v":"No"}]
[]
[null,"The project earned at least 3 points in Water Efficiency",null,null,null,null,null,null,null,{"$f":"IF(J30>=3,\"Yes\",\"No\")","v":"No"}]
[]
[null,"The project earned at least 3 points in Indoor Environmental Quality",null,null,null,null,null,null,null,{"$f":"IF(J56>=3,\"Yes\",\"No\")","v":"No"}]
[]
[null,"Total",null,null,"Preliminary    Y",{"$f":"SUM(F80,F74,F56,F48,F39,F30,F22,F11,F7)","v":0},"M",{"$f":"SUM(H80,H74,H56,H48,H39,H30,H22,H11,H7)","v":0},"Verified",{"$f":"SUM(J80,J74,J56,J48,J39,J30,J22,J11,J7)","v":0}]
[null,"Certification Thresholds      Certified: 40-49, Silver: 50-59, Gold: 60-79, Platinum: 80-110"]

{"sheet":"Batch - Multifamily","index":3,"n_rows":23,"n_cols":12,"rows_kept":23,"cut":false,"hidden":true,"merged":[[6,1,6,11],[12,9,12,10],[7,1,7,5],[8,1,8,5],[9,1,9,5],[12,1,12,7]]}
[]
[null,"Certification Submittal for Batches of Multifamily Buildings"]
[null,{"$f":"CONCATENATE(\"Batch Registration Set ID #\",Instructions!F70)","v":"Batch Registration Set ID #"}]
[null,{"$f":"CONCATENATE(\"Building type: \",Instructions!F73)","v":"Building type: "}]
[]
[]
[null,"The following is a list of homes to be submitted for certification as a batch. As per LEED for Homes guidelines, every building in this batch submittal will meet or exceed the performance requirements for every prerequisite and credit awarded on the project checklist. "]
[null,"Total number of buildings ",null,null,null,null,{"$f":"COUNTA(C15:C22)","v":0}]
[null,"Total number of units ",null,null,null,null,{"$f":"SUM(F15:F22)","v":0}]
[null,{"$f":"CONCATENATE(\"Total conditioned floor area\",IF(Instructions!$I$85=1,\" (sq ft)\",\" (sq m)\"))","v":"Total conditioned floor area (sq ft)"},null,null,null,null,{"$f":"SUM(G15:G22)","v":0}]
[]
[null,"Note: The General Information section must be consistent with project details in LEED Online."]
[null,"General Information",null,null,null,null,null,null,"Home Size Adjustment","Energy Performance",null,"EA Credit Annual Energy Use"]
[null,null,"Project ID","Street Address or \nLot Number","Project City","Total Number\nof Units",{"$f":"CONCATENATE(\"Total Conditioned Floor Area\",IF(Instructions!$I$85=1,\" \n(sq ft)\",\" \n(sq m)\"))","v":"Total Conditioned Floor Area \n(sq ft)"},"Total Number\nof Bedrooms",{"$f":"IF(RatingSystem=1,\"Home Size Adjustment \n(if applicable)\",\"Home Size Adjustment\")","v":"Home Size Adjustment \n(if applicable)"},{"$f":"IF(RatingSystem=1,\"HERS or % Improvement over LEED Reference Home\",\"% Energy Cost Savings\")","v":"HERS or % Improvement over LEED Reference Home"},"EA \nPoints","Total Score\n(EA points + HSA points)"]
[{"$f":"IF(C15>0,0,0)","v":0},{"$f":"B14+1","v":1},null,null,null,null,null,null,null,null,null,{"$f":"SUM(I15+K15)","v":0}]
[0,2,null,null,null,null,null,null,null,null,null,{"$f":"SUM(I16+K16)","v":0}]
[0,3,null,null,null,null,null,null,null,null,null,0]
[0,4,null,null,null,null,null,null,null,null,null,0]
[0,5,null,null,null,null,null,null,null,null,null,0]
[0,6,null,null,null,null,null,null,null,null,null,{"$f":"SUM(I20+K20)","v":0}]
["A"]
[]
["A"]

{"sheet":"Multifamily HSA","index":4,"n_rows":14,"n_cols":16,"rows_kept":14,"cut":false,"hidden":true,"merged":[[10,14,10,15],[4,1,4,15],[6,1,7,1],[6,2,6,3],[6,4,6,5],[6,6,6,7],[6,8,6,9],[6,10,6,11],[6,12,6,13],[6,14,6,15],[13,1,13,14],[12,1,12,14],[9,14,9,15],[9,2,9,3],[9,4,9,5],[9,6,9,7],[9,8,9,9],[9,10,9,11],[9,12,9,13],[11,1,11,14],[10,4,10,5],[10,6,10,7],[10,2,10,3],[10,8,10,9],[10,10,10,11],[10,12,10,13]]}
[]
[null,"Multifamily Home Size Adjuster"]
[]
[]
[null,"This approach can be used to determine an overall home size adjuster for multifamily buildings. \n\nInput the number of units and the average square footage for units with the corresponding bedroom number. For example, if the building has three 2-bedroom units that are 1300 sq ft, 1400 sq ft, and 1500 sq ft, insert \"3\" in cell G9 and \"1400\" in cell H9. Please leave zeroes or blanks where appropriate.\n\nThis approach can also be used to determine an overall home size adjuster for a complex with multiple residential buildings.  If a project includes multiple residential buildings, add all the buildings together like it’s a single-mega structure. For example, if building A has four 2-bedroom units and building B has six 2-bedroom units, insert “10” in cell G9. Average the square footage for all units in the complex with the corresponding bedroom quantity."]
[]
[null,"Building ID","0 Bedrooms",null,"1 Bedroom",null,"2 Bedrooms",null,"3 Bedrooms",null,"4 Bedrooms",null,"5 Bedrooms",null,"6 Bedrooms"]
[null,null,"Number \nof Units",{"$f":"CONCATENATE(\"Average \nFloor Area\n\",IF(Instructions!$I$85=1,\" (sq ft)\",\" (sq m)\"))","v":"Average \nFloor Area\n (sq ft)"},"Number \nof Units",{"$f":"CONCATENATE(\"Average \nFloor Area\n\",IF(Instructions!$I$85=1,\" (sq ft)\",\" (sq m)\"))","v":"Average \nFloor Area\n (sq ft)"},"Number \nof Units",{"$f":"CONCATENATE(\"Average \nFloor Area\n\",IF(Instructions!$I$85=1,\" (sq ft)\",\" (sq m)\"))","v":"Average \nFloor Area\n (sq ft)"},"Number \nof Units",{"$f":"CONCATENATE(\"Average \nFloor Area\n\",IF(Instructions!$I$85=1,\" (sq ft)\",\" (sq m)\"))","v":"Average \nFloor Area\n (sq ft)"},"Number \nof Units",{"$f":"CONCATENATE(\"Average \nFloor Area\n\",IF(Instructions!$I$85=1,\" (sq ft)\",\" (sq m)\"))","v":"Average \nFloor Area\n (sq ft)"},"Number \nof Units",{"$f":"CONCATENATE(\"Average \nFloor Area\n\",IF(Instructions!$I$85=1,\" (sq ft)\",\" (sq m)\"))","v":"Average \nFloor Area\n (sq ft)"},"Number \nof Units",{"$f":"CONCATENATE(\"Average \nFloor Area\n\",IF(Instructions!$I$85=1,\" (sq ft)\",\" (sq m)\"))","v":"Average \nFloor Area\n (sq ft)"}]
[]
[null,"Home size adjustment",{"$f":"IF(D9>0,IF(Instructions!$I$85=1,1-(D9/1000),1-(D9/93)),0)","v":0},null,{"$f":"IF(F9>0,IF(Instructions!$I$85=1,1-(F9/1000),1-(F9/93)),0)","v":0},null,{"$f":"IF(H9>0,IF(Instructions!$I$85=1,1-(H9/1600),1-(H9/148)),0)","v":0},null,{"$f":"IF(J9>0,IF(Instructions!$I$85=1,1-(J9/2200),1-(J9/204)),0)","v":0},null,{"$f":"IF(L9>0,IF(Instructions!$I$85=1,1-(L9/2800),1-(L9/260)),0)","v":0},null,{"$f":"IF(N9>0,IF(Instructions!$I$85=1,1-(N9/3400),1-(N9/315)),0)","v":0},null,{"$f":"IF(P9>0,IF(Instructions!$I$85=1,1-(P9/4000),1-(P9/427)),0)","v":0}]
[null,"Point adjustment",{"$f":"C10/0.04","v":0},null,{"$f":"E10/0.04","v":0},null,{"$f":"G10/0.04","v":0},null,{"$f":"I10/0.04","v":0},null,{"$f":"K10/0.04","v":0},null,{"$f":"M10/0.04","v":0},null,{"$f":"O10/0.04","v":0}]
[null,"Total number of units",null,null,null,null,null,null,null,null,null,null,null,null,null,{"$f":"SUM(M9,K9,I9,G9,E9,C9, O9)","v":0}]
[null,"Average adjustment",null,null,null,null,null,null,null,null,null,null,null,null,null,{"$f":"IF(P12=0,0.0001,(C11*C9+E11*E9+G11*G9+I11*I9+K11*K9+M11*M9+O11*O9)/P12)","v":1E-4}]
[null,"Average home size point adjustment",null,null,null,null,null,null,null,null,null,null,null,null,null,{"$f":"ROUNDDOWN(P13,0)+IF(P13-ROUNDDOWN(P13,0)>=0.75,1,IF(P13-ROUNDDOWN(P13,0)>=0.25,0.5,IF(P13-ROUNDDOWN(P13,0)>=-0.25,0,IF(P13-ROUNDDOWN(P13,0)>=-0.75,-0.5,-1))))","v":0}]

{"sheet":"Batch - Single Family","index":5,"n_rows":28,"n_cols":18,"rows_kept":28,"cut":false,"hidden":false,"merged":[[13,11,13,17],[6,1,6,8],[7,1,7,5],[8,1,8,5],[9,1,9,5],[10,1,10,5],[13,1,13,6],[13,7,13,10]]}
[]
[null,"Certification Submittal for Batches of Single Family Homes"]
[null,{"$f":"CONCATENATE(\"Batch Registration Set ID #\",Instructions!F70)","v":"Batch Registration Set ID #"}]
[null,{"$f":"CONCATENATE(\"Building type: \",Instructions!F73)","v":"Building type: "}]
[]
[]
[null,"The following is a list of homes to be submitted for certification as a batch. As per LEED for Homes guidelines, every home in this batch submittal will meet or exceed the performance requirements for every prerequisite and credit awarded on the project checklist. "]
[null,"Total number of homes",null,null,null,null,{"$f":"COUNTA(C16:C26)","v":0}]
[null,"Total EA points for LEED Energy Budget Option",null,null,null,null,{"$f":"MIN(K16:K26)","v":0}]
[null,"Total EA points for achieving HERS Index Rating",null,null,null,null,{"$f":"MIN(P16:P26)","v":0}]
[null,"Total EA points for HERS points below ENERGY STAR HERS Index Target (SAF Adjusted)",null,null,null,null,{"$f":"MIN(R16:R26)","v":0}]
[]
[null,"Note: The General Information section must be consistent with project details in LEED Online. All general information must be provided for each home in the batch."]
[null,"General Information",null,null,null,null,null,"Option 1: LEED Energy Budget",null,null,null,"Option 2: HERS Index (SAF Adjusted)"]
[null,null,"Project ID","Street Address or \nLot Number","Project City",{"$f":"CONCATENATE(\"Conditioned floor area (see comment) \",IF(Instructions!$I$85=1,\" \n(sq ft)\",\" \n(sq m)\"))","v":"Conditioned floor area (see comment)  \n(sq ft)"},"Number of bedrooms (see comment)","LEED Reference","As Designed ","Annual \nEnergy Reduction\n(%)","EA \nPoints","HERS \nIndex Rating","ENERGY STAR HERS Index Target (SAF Adjusted)","Size Adjustment Factor (SAF) from the ENERGY STAR for Homes Report","HERS Index (SAF Adjusted)","Points for achieving HERS Index Rating","HERS Index points below ENERGY STAR HERS Index Target (SAF Adjusted)","Points for HERS points below ENERGY STAR HERS Index Target (SAF Adjusted)"]
[{"$f":"IF(C16>0,0,0)","v":0},{"$f":"B15+1","v":1},null,null,null,null,null,null,null,{"$f":"IFERROR(FLOOR(1-I16/H16,0.01),\"\")","v":""},{"$f":"IF(OR(H16=\"\",I16=\"\"),\"\",IFERROR(VLOOKUP(J16,'EA Lowrise'!H:I,2),\"\"))","v":""},null,null,null,{"$f":"IF(L16=\"\",\"\",IFERROR(ROUND(L16/N16,0),0))","v":""},{"$f":"IF(OR(L16=\"\",M16=\"\"),\"\",IF(M16<0,36,(IFERROR(VLOOKUP(O16,'EA Lowrise'!N:O,2,FALSE),0))))","v":""},{"$f":"IFERROR(M16-O16,\"\")","v":""},{"$f":"IF(OR(L16=\"\",M16=\"\"),\"\",IFERROR(VLOOKUP(Q16,'EA Lowrise'!$K$1:$L$1500,2,FALSE),0))","v":""}]
[0,{"$f":"B16+1","v":2},null,null,null,null,null,null,null,{"$f":"IFERROR(FLOOR(1-I17/H17,0.01),\"\")","v":""},{"$f":"IF(OR(H17=\"\",I17=\"\"),\"\",IFERROR(VLOOKUP(J17,'EA Lowrise'!H:I,2),\"\"))","v":""},null,null,null,{"$f":"IF(L17=\"\",\"\",IFERROR(ROUND(L17/N17,0),0))","v":""},{"$f":"IF(OR(L17=\"\",M17=\"\"),\"\",IF(M17<0,36,(IFERROR(VLOOKUP(O17,'EA Lowrise'!N:O,2,FALSE),0))))","v":""},{"$f":"IFERROR(M17-O17,\"\")","v":""},{"$f":"IF(OR(L17=\"\",M17=\"\"),\"\",IFERROR(VLOOKUP(Q17,'EA Lowrise'!$K$1:$L$1500,2,FALSE),0))","v":""}]
[0,3,null,null,null,null,null,null,null,"",{"$f":"IF(OR(H18=\"\",I18=\"\"),\"\",IFERROR(VLOOKUP(J18,'EA Lowrise'!H:I,2),\"\"))","v":""},null,null,null,"",{"$f":"IF(OR(L18=\"\",M18=\"\"),\"\",IF(M18<0,36,(IFERROR(VLOOKUP(O18,'EA Lowrise'!N:O,2,FALSE),0))))","v":""},"",{"$f":"IF(OR(L18=\"\",M18=\"\"),\"\",IFERROR(VLOOKUP(Q18,'EA Lowrise'!$K$1:$L$1500,2,FALSE),0))","v":""}]
[0,4,null,null,null,null,null,null,null,"",{"$f":"IF(OR(H19=\"\",I19=\"\"),\"\",IFERROR(VLOOKUP(J19,'EA Lowrise'!H:I,2),\"\"))","v":""},null,null,null,"",{"$f":"IF(OR(L19=\"\",M19=\"\"),\"\",IF(M19<0,36,(IFERROR(VLOOKUP(O19,'EA Lowrise'!N:O,2,FALSE),0))))","v":""},"",{"$f":"IF(OR(L19=\"\",M19=\"\"),\"\",IFERROR(VLOOKUP(Q19,'EA Lowrise'!$K$1:$L$1500,2,FALSE),0))","v":""}]
[0,5,null,null,null,null,null,null,null,"",{"$f":"IF(OR(H20=\"\",I20=\"\"),\"\",IFERROR(VLOOKUP(J20,'EA Lowrise'!H:I,2),\"\"))","v":""},null,null,null,"",{"$f":"IF(OR(L20=\"\",M20=\"\"),\"\",IF(M20<0,36,(IFERROR(VLOOKUP(O20,'EA Lowrise'!N:O,2,FALSE),0))))","v":""},"",{"$f":"IF(OR(L20=\"\",M20=\"\"),\"\",IFERROR(VLOOKUP(Q20,'EA Lowrise'!$K$1:$L$1500,2,FALSE),0))","v":""}]
[{"$f":"IF(C21>0,0,0)","v":0},6,null,null,null,null,null,null,null,"",{"$f":"IF(OR(H21=\"\",I21=\"\"),\"\",IFERROR(VLOOKUP(J21,'EA Lowrise'!H:I,2),\"\"))","v":""},null,null,null,"",{"$f":"IF(OR(L21=\"\",M21=\"\"),\"\",IF(M21<0,36,(IFERROR(VLOOKUP(O21,'EA Lowrise'!N:O,2,FALSE),0))))","v":""},"",{"$f":"IF(OR(L21=\"\",M21=\"\"),\"\",IFERROR(VLOOKUP(Q21,'EA Lowrise'!$K$1:$L$1500,2,FALSE),0))","v":""}]
[{"$f":"IF(C22>0,0,0)","v":0},7,null,null,null,null,null,null,null,"",{"$f":"IF(OR(H22=\"\",I22=\"\"),\"\",IFERROR(VLOOKUP(J22,'EA Lowrise'!H:I,2),\"\"))","v":""},null,null,null,"",{"$f":"IF(OR(L22=\"\",M22=\"\"),\"\",IF(M22<0,36,(IFERROR(VLOOKUP(O22,'EA Lowrise'!N:O,2,FALSE),0))))","v":""},"",{"$f":"IF(OR(L22=\"\",M22=\"\"),\"\",IFERROR(VLOOKUP(Q22,'EA Lowrise'!$K$1:$L$1500,2,FALSE),0))","v":""}]
[{"$f":"IF(C23>0,0,0)","v":0},8,null,null,null,null,null,null,null,"",{"$f":"IF(OR(H23=\"\",I23=\"\"),\"\",IFERROR(VLOOKUP(J23,'EA Lowrise'!H:I,2),\"\"))","v":""},null,null,null,"",{"$f":"IF(OR(L23=\"\",M23=\"\"),\"\",IF(M23<0,36,(IFERROR(VLOOKUP(O23,'EA Lowrise'!N:O,2,FALSE),0))))","v":""},"",{"$f":"IF(OR(L23=\"\",M23=\"\"),\"\",IFERROR(VLOOKUP(Q23,'EA Lowrise'!$K$1:$L$1500,2,FALSE),0))","v":""}]
[0,9,null,null,null,null,null,null,null,"",{"$f":"IF(OR(H24=\"\",I24=\"\"),\"\",IFERROR(VLOOKUP(J24,'EA Lowrise'!H:I,2),\"\"))","v":""},null,null,null,"",{"$f":"IF(OR(L24=\"\",M24=\"\"),\"\",IF(M24<0,36,(IFERROR(VLOOKUP(O24,'EA Lowrise'!N:O,2,FALSE),0))))","v":""},"",{"$f":"IF(OR(L24=\"\",M24=\"\"),\"\",IFERROR(VLOOKUP(Q24,'EA Lowrise'!$K$1:$L$1500,2,FALSE),0))","v":""}]
[0,10,null,null,null,null,null,null,null,"",{"$f":"IF(OR(H25=\"\",I25=\"\"),\"\",IFERROR(VLOOKUP(J25,'EA Lowrise'!H:I,2),\"\"))","v":""},null,null,null,"",{"$f":"IF(OR(L25=\"\",M25=\"\"),\"\",IF(M25<0,36,(IFERROR(VLOOKUP(O25,'EA Lowrise'!N:O,2,FALSE),0))))","v":""},"",{"$f":"IF(OR(L25=\"\",M25=\"\"),\"\",IFERROR(VLOOKUP(Q25,'EA Lowrise'!$K$1:$L$1500,2,FALSE),0))","v":""}]
[]
[]
["A"]

{"sheet":"IP","index":6,"n_rows":49,"n_cols":17,"rows_kept":49,"cut":false,"hidden":false,"merged":[[44,3,45,9],[20,3,26,9],[20,15,21,15],[4,1,4,3],[35,15,36,15],[13,3,18,9],[28,3,29,9],[35,3,36,9]]}
[null,"Integrative Process",null,null,null,null,null,null,null,null,null,"Notes","Verified \n(initials)","Date \nVerified","QAD Notes","Verification Measure","QAD Notes"]
[]
[null,null,null,null,"Preliminary    Y",{"$f":"F7","v":0},"Maybe",{"$f":"H7","v":0},"Verified",{"$f":"J7","v":0}]
[]
["IPc1",{"$f":"L5","v":"IP Credit Integrative Process"},null,null,null,null,null,null,null,null,"HM","IP Credit Integrative Process"]
[null,null,null,null,null,null,null,null,null,null,"HM"]
[null,"Up to 2 points",null,null,"Preliminary    Y",{"$f":"IF(SUM(F11,F33,F42)>2,2,SUM(F11,F33,F42))","v":0},"M",{"$f":"IF(SUM(H11,H33,H42)>2,2,SUM(H11,H33,H42))","v":0},"Verified",{"$f":"IF(SUM(J11,J33,J42)>2,2,SUM(J11,J33,J42))","v":0},"HM",null,"Responsible Party"]
[null,"Exemplary Performance: Achieve all three options",null,null,null,null,null,null,null,null,"HM"]
[null,null,null,null,null,null,null,null,null,null,"HM"]
[null,null,null,null,null,null,null,null,null,null,"HM"]
[null,null,"Option 1. Integrative Project Team (1 point)",null,"Y",null,"M",null,"V",null,"HM",{"$f":"C11","v":"Option 1. Integrative Project Team (1 point)"}]
[null,null,null,null,null,null,null,null,null,null,"HM"]
[null,null,null,null,null,null,null,null,null,null,"HM"]
[null,null,"(Select one)","Team members include capabilities in at least three of the following skill sets:\narchitecture or residential building design;\nmechanical or energy engineering;\nbuilding science or performance testing;\ngreen building or sustainable design; and\ncivil engineering, landscape architecture, habitat restoration, or land-use planning.",null,null,null,null,null,null,"HM",null,null,null,null,"Verify listed people are members of project team."]
[null,null,null,null,null,null,null,null,null,null,"HM"]
[null,null,null,null,null,null,null,null,null,null,"HM"]
[null,null,null,null,null,null,null,null,null,null,"HM"]
[null,null,null,null,null,null,null,null,null,null,"HM"]
[null,null,null,null,null,null,null,null,null,null,"HM"]
[null,null,null,null,null,null,null,null,null,null,"HM"]
[null,null,"(Select one)","All team members referenced above were involved in at least three of the following phases of the design and construction process:\nconceptual or schematic design;\nLEED planning;\npreliminary design;\nenergy and envelope systems analysis or design;\ndesign development;\nfinal design, working drawings or specifications; \nand construction.",null,null,null,null,null,null,"HM",null,null,null,null,"Verify meeting dates are for at least three phases of design and construction process."]
[null,null,null,null,null,null,null,null,null,null,"HM"]
[null,null,null,null,null,null,null,null,null,null,"HM"]
[null,null,null,null,null,null,null,null,null,null,"HM"]
[null,null,null,null,null,null,null,null,null,null,"HM"]
[null,null,null,null,null,null,null,null,null,null,"HM"]
[null,null,null,null,null,null,null,null,null,null,"HM"]
[null,null,null,null,null,null,null,null,null,null,"HM"]
[null,null,"(Select one)","Meetings were conducted with the project team at least monthly to review project status, introduce new team members to project goals, discuss problems, formulate solutions, review responsibilities, and identify next steps.",null,null,null,null,null,null,"HM"]
[null,null,null,null,null,null,null,null,null,null,"HM"]
[null,null,null,null,null,null,null,null,null,null,"HM"]
[null,null,"AND/OR",null,null,null,null,null,null,null,"HM"]
[null,null,"Option 2. Design Charrette (1 point)",null," Y",null,"M",null,"V",null,"HM",{"$f":"C33","v":"Option 2. Design Charrette (1 point)"}]
[null,null,null,null,null,null,null,null,null,null,"HM"]
[null,null,null,null,null,null,null,null,null,null,"HM"]
[null,null,"(Select one)","A full-day workshop (or two half-day workshops) was conducted with the project team, as defined in Option 1, no later than the design development phase.",null,null,null,null,null,null,"HM",null,null,null,null,"Participate in design charrette or verify charrette date, location, participants, and duration."]
[null,null,null,null,null,null,null,null,null,null,"HM"]
[null,null,null,"Date(s)",null,null,null,null,null,null,"HM"]
[null,null,null,"Duration",null,null,null,null,null,null,"HM"]
[null,null,null,null,null,null,null,null,null,null,"HM"]
[null,null,"AND/OR",null,null,null,null,null,null,null,"HM"]
[null,null,"Option 3. Installation Contractor Training (1 point)",null,"Y",null,"M",null,"V",null,"HM",{"$f":"C42","v":"Option 3. Installation Contractor Training (1 point)"}]
[null,null,null,null,null,null,null,null,null,null,"HM"]
[null,null,null,null,null,null,null,null,null,null,"HM"]
[null,null,"(Select one)","At least eight hours of training on the green aspects of the project and how the installation contractors can contribute to achieving each LEED for Homes prerequisite and attempted credit was conducted before construction but after installation contractors have been hired for the project. ",null,null,null,null,null,null,"HM",null,null,null,null,"Conduct trades training or verify training date, location, participants, and duration."]
[null,null,null,null,null,null,null,null,null,null,"HM"]
[null,null,null,"Date(s)",null,null,null,null,null,null,"HM"]
[null,null,null,"Duration",null,null,null,null,null,null,"HM"]
[null,null,null,"Trainer",null,null,null,null,null,null,"HM"]

{"sheet":"LT","index":7,"n_rows":137,"n_cols":17,"rows_kept":137,"cut":false,"hidden":false,"merged":[[4,1,4,3],[16,1,16,3],[29,1,29,3],[108,1,108,3],[42,3,42,5],[43,3,43,5],[64,3,64,8],[81,3,81,5],[54,3,54,9],[67,3,67,5],[50,3,50,9],[52,3,52,9],[56,3,56,9],[58,3,58,9],[21,2,21,3],[23,2,23,3],[25,2,25,3],[27,2,27,3],[41,3,41,5],[134,3,134,5],[135,3,135,5],[125,3,125,5],[115,3,115,5],[116,3,116,5],[117,3,117,5],[127,1,127,3],[119,1,119,3],[114,3,114,5]]}
[null,"Location and Transportation",null,null,null,null,null,null,null,null,null,"Notes","Verified \n(initials)","Date \nVerified","QAD Notes","Verification Measure","QAD Notes"]
[]
[null,null,null,null,"Preliminary    Y",{"$f":"IF(LT!$F$19=10,10,SUM(F32,F111,F122,F130))","v":0},"Maybe",{"$f":"IF(H19=10,10,SUM(H19,H32,H111,H122,H130))","v":0},"Verified",{"$f":"IF(J19=10,10,SUM(J19,J32,J111,J122,J130))","v":0}]
[]
["LTp1",{"$f":"L5","v":"LT Prerequisite Floodplain Avoidance"},null,null,null,null,null,null,null,null,"HM","LT Prerequisite Floodplain Avoidance"]
[null,null,null,null,null,null,null,null,null,null,"HM"]
[null,"Required",null,null,null,"Required",null,null,"Verified","N","HM",null,"Responsible Party"]
[null,null,null,null,null,null,null,null,null,null,"HM"]
[null,null,null,null,null,null,null,null,null,null,"HM"]
[null,null,"Select one of the following:",null,null,null,null,null,null,null,"HM"]
[null,null,"(Select one)","The project is not built on land within a flood hazard area.",null,null,null,null,null,null,"HM",null,null,null,null,"Verify that floodplain map is for actual location of building and the building is above floodplain."]
[null,null,null,null,null,null,null,null,null,null,"HM"]
[null,null,"(Select one)","The project is built on land within a flood hazard area and in accordance with flood provisions.",null,null,null,null,null,null,"HM",null,null,null,null,"Verify that building meets local flood provisions."]
[null,null,null,null,null,null,null,null,null,null,"HM"]
[null,null,"(Select one)","The project is built on land within a flood hazard area and is a previously developed building and hardscape.",null,null,null,null,null,null,"HM",null,null,null,null,"Verify that building was previously developed."]
[null,null,null,null,null,null,null,null,null,null,"HM"]
["LTc1",{"$f":"L17","v":"LT Credit LEED for Neighborhood Development"},null,null,null,null,null,null,null,null,"HM","LT Credit LEED for Neighborhood Development"]
[null,null,null,null,null,null,null,null,null,null,"HM"]
[null,"10 points",null,null,"Preliminary    Y",null,"M",0,"Verified",0,"HM",null,"Responsible Party"]
[null,null,null,null,null,null,null,null,null,null,"HM"]
[null,null,null,null,null,null,null,null,null,null,"HM"]
[null,null,null,null,"Name of LEED for Neighborhood Development project",null,null,null,null,null,"HM",null,null,null,null,"Verify that the project is located within the certified LEED ND project boundary."]
[null,null,null,null,null,null,null,null,null,null,"HM"]
[null,null,null,null,"LEED ND project ID number",null,null,null,null,null,"HM"]
[null,null,null,null,null,null,null,null,null,null,"HM"]
[null,null,null,null,"Rating system and version",null,null,null,null,null,"HM"]
[null,null,null,null,null,null,null,null,null,null,"HM"]
[null,null,null,null,"LEED ND certification date",null,null,null,null,null,"HM"]
[null,null,null,null,null,null,null,null,null,null,"HM"]
["LTc2",{"$f":"L30","v":"LT Credit Site Selection"},null,null,null,null,null,null,null,null,"HM","LT Credit Site Selection"]
[null,null,null,null,null,null,null,null,null,null,"HM"]
[null,"Up to 6 points",null,null,"Preliminary    Y",{"$f":"IF(SUM(F36,F62,F71,F79,F85,F98,F104)>6,6,SUM(F36,F62,F71,F79,F85,F98,F104))","v":0},"M",{"$f":"IF(SUM(H36,H62,H71,H79,H85,H98,H104)>6,6,SUM(H36,H62,H71,H79,H85,H98,H104))","v":0},"Verified",{"$f":"IF(SUM(J36,J62,J71,J79,J85,J98,J104)>6,6,SUM(J36,J62,J71,J79,J85,J98,J104))","v":0},"HM",null,"Responsible Party"]
[null,"Exemplary Performance: Earn more than the maximum 6 points",null,null,null,null,null,null,null,null,"HM"]
[null,null,null,null,null,null,null,null,null,null,"HM"]
[null,null,null,null,null,null,null,null,null,null,"HM"]
[null,null,"Option 1. Sensitive Land Protection (3-4 points)",null,"Y",{"$f":"IF(F39>0,F39,F47)","v":0},"M",{"$f":"IF(H39>0,H39,H47)","v":0},"V",{"$f":"IF(J39>0,J39,J47)","v":0},"HM",{"$f":"C36","v":"Option 1. Sensitive Land Protection (3-4 points)"}]
[null,null,null,null,null,null,null,null,null,null,"HM"]
[null,null,null,null,null,null,null,null,null,null,"HM"]
[null,null,"Path 1. Previously Developed (4 points)",null,"Y",null,"M",null,"V",null,"HM",{"$f":"C39","v":"Path 1. Previously Developed (4 points)"}]
[null,null,null,null,null,null,null,null,null,null,"HM"]
[null,null,null,null,null,null,null,null,null,null,"HM"]
[null,null,null,{"$f":"CONCATENATE(\"Total buildable land area\",IF(Instructions!$I$85=1,\" (acre or sq ft)\",\" (hectare or sq m)\"))","v":"Total buildable land area (acre or sq ft)"},null,null,null,null,null,null,"HM",null,null,null,null,"Verify historical documents, maps, or comparable evidence of previous development; OR conduct on-site verification of existing infrastructure (e.g. foundation footings)."]
[null,null,null,{"$f":"CONCATENATE(\"Previously developed buildable land area\",IF(Instructions!$I$85=1,\" (acre or sq ft)\",\" (hectare or sq m)\"))","v":"Previously developed buildable land area (acre or sq ft)"},null,null,null,null,null,null,"HM"]
[null,null,{"$f":"IFERROR(C43/C42,0)","v":0},"Percentage of lot previously developed (%)",null,null,null,null,null,null,"HM"]
[null,null,null,null,null,null,null,null,null,null,"HM"]
[null,null,"OR",null,null,null,null,null,null,null,"HM"]
[null,null,"Path 2. Avoidance of Sensitive Land (3 points)",null,"Y",null,"M",null,"V",null,"HM",{"$f":"C47","v":"Path 2. Avoidance of Sensitive Land (3 points)"}]
[null,null,null,null,null,null,null,null,null,null,"HM"]
[null,null,null,null,null,null,null,null,null,null,"HM"]
[null,null,"Locate the development footprint on land that does not meet the following criteria for sensitive land:",null,null,null,null,null,null,null,"HM"]
[null,null,"(Select one)","Prime farmland.",null,null,null,null,null,null,"HM",null,null,null,null,"Verify that soil data map or supporting documentation that demonstrates development is not on qualifying farmland is for actual location of development."]
[null,null,null,null,null,null,null,null,null,null,"HM"]
[null,null,"(Select one)","Floodplains.",null,null,null,null,null,null,"HM",null,null,null,null,"Visually verify that development is not next to parkland or verify documentation the developed land was not parkland or, if parkland, was traded for land to public landowner."]
[null,null,null,null,null,null,null,null,null,null,"HM"]
[null,null,"(Select one)","Habitat.",null,null,null,null,null,null,"HM",null,null,null,null,"Verify that floodplain map is for actual location of building and that building is above floodplain."]
[null,null,null,null,null,null,null,null,null,null,"HM"]
[null,null,"(Select one)","Water bodies.",null,null,null,null,null,null,"HM",null,null,null,null,"Verify that documentation demonstrating project is not on land identified as habitat is for actual location of building."]
[null,null,null,null,null,null,null,null,null,null,"HM"]
[null,null,"(Select one)","Wetlands.",null,null,null,null,null,null,"HM",null,null,null,null,"Visually verify that development is not within 100 ft (30 m) of water bodies."]
[null,null,null,null,null,null,null,null,null,null,"HM"]
[null,null,"AND/OR",null,null,null,null,null,null,null,"HM"]
[null,null,"Option 2. Infill Development (2 points)",null,"Y",null,"M",null,"V",null,"HM",{"$f":"C62","v":"Option 2. Infill Development (2 points)"}]
[null,null,null,null,null,null,null,null,null,null,"HM"]
[null,null,null,null,null,null,null,null,null,null,"HM"]
[null,null,null,"Percent of land within a 1/2 mile (800 meters) from the project boundary that is previously developed",null,null,null,null,null,null,"HM",null,null,null,null,"Verify map and calculations that development within 1/2 mile (800 meters) of project boundary is previously developed."]
[null,null,null,null,null,null,null,null,null,null,"HM"]
[null,null,"Alternatively, for projects within city limits of towns with populations less than 20,000",null,null,null,null,null,null,null,"HM",{"$f":"C67","v":"Alternatively, for projects within city limits of towns with populations less than 20,000"}]
[null,null,null,"Percent of land adjacent to the project boundary that is previously developed",null,null,null,null,null,null,"HM",null,null,null,null,"Verify on-site that at least 75% of lot borders previously developed land."]
[null,null,null,null,null,null,null,null,null,null,"HM"]
[null,null,"AND/OR",null,null,null,null,null,null,null,"HM"]
[null,null,"Option 3. Open Space (1 point)",null,"Y",null,"M",null,"V",null,"HM",{"$f":"C71","v":"Option 3. Open Space (1 point)"}]
[null,null,null,null,null,null,null,null,null,null,"HM"]
[null,null,null,null,null,null,null,null,null,null,"HM"]
[null,null,"Select one of the following:",null,null,null,null,null,null,null,"HM"]
[null,null,"(Select one)","Built within 1/2 mile (800 meters) of open space that is at least 3/4 acres (0.3 hectares)",null,null,null,null,null,null,"HM",null,null,null,null,"Conduct on-site certification or verify maps and calculations of publicly accessible open space of at least 3/4 acre (0.3 hectares) within 1/2 mile (800 meters) of home."]
[null,null,"(Select one)","Create publically available open space on the project site",null,null,null,null,null,null,"HM"]
[null,null,null,null,null,null,null,null,null,null,"HM"]
[null,null,"AND/OR",null,null,null,null,null,null,null,"HM"]
[null,null,"Option 4. Street Network (1 point)",null,"Y",null,"M",null,"V",null,"HM",{"$f":"C79","v":"Option 4. Street Network (1 point)"}]
[null,null,null,null,null,null,null,null,null,null,"HM"]
[null,null,null,null,null,null,null,null,null,null,"HM"]
[null,null,null,{"$f":"CONCATENATE(\"Qualifying intersection density (intersections per\",IF(Instructions!$I$85=1,\" square mile)\",\" square kilometer)\"))","v":"Qualifying intersection density (intersections per square mile)"},null,null,null,null,null,null,"HM",null,null,null,null,"Verify that documentation is for actual location of development and that required intersection density has been met."]
[null,null,null,null,null,null,null,null,null,null,"HM"]
[null,null,"AND/OR",null,null,null,null,null,null,null,"HM"]
[null,null,"Option 5. Bicycle Network and Storage (1 point)",null,"Y",null,"M",null,"V",null,"HM",{"$f":"C85","v":"Option 5. Bicycle Network and Storage (1 point)"}]
[null,null,null,null,null,null,null,null,null,null,"HM"]
[null,null,null,null,null,null,null,null,null,null,"HM"]
[null,null,"Bicycle Network",null,null,null,null,null,null,null,"HM",{"$f":"C88","v":"Bicycle Network"}]
[null,null,"Select one of the following.  The project has a functional entry and/or bicycle storage within 200 yd (180 m) of a bicycle network that connects to:",null,null,null,null,null,null,null,"HM"]
[null,null,"(Select one)","At least 10 uses",null,null,null,null,null,null,"HM",null,null,null,null,"Verify documentation that qualifying resources are on bicycle network."]
[null,null,"(Select one)","A school or employment center",null,null,null,null,null,null,"HM"]
[null,null,"(Select one)","A bus rapid transit stops, rail stations, and/or ferry terminals",null,null,null,null,null,null,"HM"]
[null,null,null,null,null,null,null,null,null,null,"HM"]
[null,null,"Bicycle Storage for Single Family Homes",null,null,null,null,null,null,null,"HM",{"$f":"C94","v":"Bicycle Storage for Single Family Homes"}]
[null,null,"(Select one)","The project is a single family home with garage, or has secure and covered bicycle storage.",null,null,null,null,null,null,"HM",null,null,null,null,"Verify that adequate bicycle storage is installed on site."]
[]
[null,null,"AND/OR"]
[null,null,"Option 6. Existing Infrastructure (1 point)",null,"Y",null,"M",null,"V",null,null,{"$f":"C98","v":"Option 6. Existing Infrastructure (1 point)"}]
[null,null,null,null,null,null,null,null,null,null,"HM"]
[null,null,null,null,null,null,null,null,null,null,"HM"]
[null,null,"(Select one)","Lot is within 1/2 mile of existing water service and sewer service lines",null,null,null,null,null,null,null,null,null,null,null,"Verify that lot is within 1/2 mile of existing water service and swer service lines."]
[]
[null,null,"AND/OR"]
[null,null,"Option 7. Sidewalks (1 point)",null,"Y",null,"M",null,"V",null,null,{"$f":"C104","v":"Option 7. Sidewalks (1 point)"}]
[null,null,null,null,null,null,null,null,null,null,"HM"]
[null,null,null,null,null,null,null,null,null,null,"HM"]
[null,null,"(Select one)","Lot has qualifying sidewalks",null,null,null,null,null,null,null,null,null,null,null,"Verify that lot has qualifying sidewalks"]
[null,null,null,null,null,null,null,null,null,null,"HM"]
["LTc3",{"$f":"L109","v":"LT Credit Compact Development"},null,null,null,null,null,null,null,null,"HM","LT Credit Compact Development"]
[null,null,null,null,null,null,null,null,null,null,"HM"]
[null,"1 point",null,null,"Preliminary    Y",0,"M",0,"Verified",0,"HM",null,"Responsible Party"]
[null,"Exemplary Performance: 12 DU/acre (30 DU/hectare)",null,null,null,null,null,null,null,null,"HM"]
[null,null,null,null,null,null,null,null,null,null,"HM"]
[null,null,null,null,null,null,null,null,null,null,"HM"]
[null,null,null,{"$f":"CONCATENATE(\"Total project boundary area\",IF(Instructions!$I$85=1,\" (acre)\",\" (hectare)\"))","v":"Total project boundary area (acre)"}]
[null,null,null,{"$f":"CONCATENATE(\"Buildable land area\",IF(Instructions!$I$85=1,\" (acre)\",\" (hectare)\"))","v":"Buildable land area (acre)"},null,null,null,null,null,null,"HM",null,null,null,null,"Verify calculations of average housing density."]
[null,null,null,"Number of dwelling units",null,null,null,null,null,null,"HM"]
[null,null,{"$f":"IFERROR(C117/C116,0)","v":0},{"$f":"CONCATENATE(IF(Instructions!$I$85=1,\"DU/acre\",\"DU/hectare\"),\" of buildable land\")","v":"DU/acre of buildable land"},null,null,null,null,null,null,"HM"]
[null,null,null,null,null,null,null,null,null,null,"HM"]
["LTc4",{"$f":"L120","v":"LT Credit Community Resources"},null,null,null,null,null,null,null,null,"HM","LT Credit Community Resources"]
[null,null,null,null,null,null,null,null,null,null,"HM"]
[null,"1 point",null,null,"Preliminary    Y",0,"M",0,"Verified",0,"HM",null,"Responsible Party"]
[null,"Exemplary Performance:  ≥ 7 uses",null,null,null,null,null,null,null,null,"HM"]
[null,null,null,null,null,null,null,null,null,null,"HM"]
[null,null,null,null,null,null,null,null,null,null,"HM"]
[null,null,null,"Number of community resources within a 1/2 mile (800 meters) walking distance",null,null,null,null,null,null,"HM",null,null,null,null,"Verify that community resources qualify and are within walking distance."]
[null,null,null,null,null,null,null,null,null,null,"HM"]
["LTc5",{"$f":"L128","v":"LT Credit Access to Transit"},null,null,null,null,null,null,null,null,"HM","LT Credit Access to Transit"]
[null,null,null,null,null,null,null,null,null,null,"HM"]
[null,"Up to 2 points",null,null,"Preliminary    Y",0,"M",0,"Verified",0,"HM",null,"Responsible Party"]
[null,"Exemplary Performance: For multiple transit types, 144 weekday trips and 108 weekend trips",null,null,null,null,null,null,null,null,"HM"]
[null,null,null,null,null,null,null,null,null,null,"HM"]
[null,null,null,null,null,null,null,null,null,null,"HM"]
[null,null,"For projects with one or more transit types (bus, streetcar, rail, or ferry)",null,null,null,null,null,null,null,"HM",{"$f":"C134","v":"For projects with one or more transit types (bus, streetcar, rail, or ferry)"}]
[null,null,null,"Number of weekday trips",null,null,null,null,null,null,"HM",null,null,null,null,"Verify transit schedules, transit stop locations, and calculations of transit rides within 1/4 mile (400 meter) or 1/2 mile (800 meter) of building."]
[null,null,null,"Number weekend day trips",null,null,null,null,null,null,"HM"]
[null,null,null,null,null,null,null,null,null,null,"HM"]

{"sheet":"SS","index":8,"n_rows":160,"n_cols":17,"rows_kept":160,"cut":false,"hidden":false,"merged":[[4,1,4,3],[31,1,31,3],[63,1,63,3],[119,1,119,3],[10,3,10,8],[12,3,12,8],[16,3,16,8],[14,3,14,9],[48,3,48,8],[49,3,49,8],[54,3,54,8],[42,3,42,8],[51,3,51,8],[45,3,45,8],[91,3,91,7],[94,3,94,7],[158,3,159,9],[18,3,19,9],[25,3,26,9],[28,3,29,9],[130,3,131,9],[135,3,136,9],[102,3,102,7],[126,3,126,8],[128,3,128,8],[96,3,96,7],[50,3,50,8],[21,3,21,8],[155,3,155,9],[152,3,153,9],[148,3,150,9],[145,3,146,9],[133,3,133,8],[138,3,138,8],[143,3,143,8],[140,3,141,9],[95,3,95,7],[66,1,66,9],[78,3,78,7],[79,3,79,7],[41,3,41,8],[43,3,43,8],[44,3,44,8],[74,3,74,7],[77,3,77,7],[87,3,87,7],[88,3,88,7],[80,3,80,7],[83,3,83,7],[84,3,84,7],[85,3,85,7],[86,3,86,7]]}
[null,"Sustainable Sites",null,null,null,null,null,null,null,null,null,"Notes","Verified \n(initials)","Date \nVerified","QAD Notes","Verification Measure","QAD Notes"]
[]
[null,null,null,null,"Preliminary    Y",{"$f":"SUM(F34,F66,F122)","v":0},"Maybe",{"$f":"SUM(H34,H66,H122)","v":0},"Verified",{"$f":"SUM(J34,J66,J122)","v":0}]
[]
["SSp1",{"$f":"L5","v":"SS Prerequisite Construction Activity Pollution Prevention "},null,null,null,null,null,null,null,null,"HM","SS Prerequisite Construction Activity Pollution Prevention "]
[null,null,null,null,null,null,null,null,null,null,"HM"]
[null,"Required",null,null,null,"Required",null,null,"Verified","N","HM",null,"Responsible Party"]
[null,null,null,null,null,null,null,null,null,null,"HM"]
[null,null,null,null,null,null,null,null,null,null,"HM"]
[null,null,"Confirm all of the following measures were implemented on the project, as applicable:",null,null,null,null,null,null,null,"HM"]
[null,null,"(Select one)","Stockpiled and protected disturbed topsoil from erosion.",null,null,null,null,null,null,"HM",null,null,null,null,"Conduct on-site verification that applicable erosion and pollution control measure is installed."]
[null,null,null,null,null,null,null,null,null,null,"HM"]
[null,null,"(Select one)","Controlled the path and velocity of runoff with silt fencing or comparable measures.",null,null,null,null,null,null,"HM"]
[null,null,null,null,null,null,null,null,null,null,"HM"]
[null,null,"(Select one)","Protected on-site storm sewer inlets, streams, and lakes with straw bales, silt fencing, silt sacks, rock filters, or comparable measures.",null,null,null,null,null,null,"HM"]
[null,null,null,null,null,null,null,null,null,null,"HM"]
[null,null,"(Select one)","Provided swales to divert surface water from hillsides.",null,null,null,null,null,null,"HM"]
[null,null,null,null,null,null,null,null,null,null,"HM"]
[null,null,"(Select one)","Used tiers, erosion blankets, compost blankets, filter socks, berms, or comparable measures to stabilize soils in any area with a slope of 15% (6.6:1) or more that was disturbed during construction.",null,null,null,null,null,null,"HM"]
[null,null,null,null,null,null,null,null,null,null,"HM"]
[null,null,null,null,null,null,null,null,null,null,"HM"]
[null,null,"(Select one)","Prevented air pollution from dust and particulate matter.",null,null,null,null,null,null,"HM"]
[null,null,null,null,null,null,null,null,null,null,"HM"]
[null,null,"OR",null,null,null,null,null,null,null,"HM",{"$f":"C24","v":"OR"}]
[null,null,"Select one of the following:",null,null,null,null,null,null,null,"HM"]
[null,null,"(Select one)","The project team created an implemented an Erosion and Sedimentation Control (ESC) plan that conforms to the requirements of the 2017 U.S. Environmental Protection Agency (EPA) Construction General Permit (CGP).",null,null,null,null,null,null,"HM",null,null,null,null,"Conduct on-site verification that applicable erosion and pollution control measure is installed."]
[null,null,null,null,null,null,null,null,null,null,"HM"]
[null,null,null,null,null,null,null,null,null,null,"HM"]
[null,null,"(Select one)","The project team created an implemented an Erosion and Sedimentation Control (ESC) plan that conforms to local standards and codes, which are as or more stringent than the 2017 U.S. Environmental Protection Agency (EPA) Construction General Permit (CGP).",null,null,null,null,null,null,"HM",null,null,null,null,"Conduct on-site verification that applicable erosion and pollution control measure is installed."]
[null,null,null,null,null,null,null,null,null,null,"HM"]
[null,null,null,null,null,null,null,null,null,null,"HM"]
["SSc1",{"$f":"L32","v":"SS Credit Heat Island Reduction"},null,null,null,null,null,null,null,null,"HM","SS Credit Heat Island Reduction"]
[null,null,null,null,null,null,null,null,null,null,"HM"]
[null,"1 point",null,null,"Preliminary    Y",{"$f":"IF(SUM(F38,F58)>1,1,SUM(F38,F58))","v":0},"M",{"$f":"IF(SUM(H38,H58)>1,1,SUM(H38,H58))","v":0},"Verified",{"$f":"IF(SUM(J38,J58)>1,1,SUM(J38,J58))","v":0},"HM",null,"Responsible Party"]
[null,"Exemplary Performance: Meet a 75% threshold for Option 1."]
[null,null,null,null,null,null,null,null,null,null,"HM"]
[null,null,null,null,null,null,null,null,null,null,"HM"]
[null,null,"Option 1. Nonroof and Roof (1 point)",null,"Y",null,"M",null,"V",null,"HM",{"$f":"C38","v":"Option 1. Nonroof and Roof (1 point)"}]
[null,null,null,null,null,null,null,null,null,null,"HM"]
[null,null,null,null,null,null,null,null,null,null,"HM"]
[null,null,"Hardscapes"]
[null,null,{"$f":"SUM(C43:C46)","v":0},{"$f":"CONCATENATE(\"Total hardscape area (driveways, walkways, patios, etc.)\",IF(Instructions!$I$85=1,\" (sq ft)\",\" (sq m)\"))","v":"Total hardscape area (driveways, walkways, patios, etc.) (sq ft)"}]
[null,null,null,{"$f":"CONCATENATE(\"Area of shaded hardscapes\",IF(Instructions!$I$85=1,\" (sq ft)\",\" (sq m)\"))","v":"Area of shaded hardscapes (sq ft)"},null,null,null,null,null,null,"HM"]
[null,null,null,{"$f":"CONCATENATE(\"Area of unshaded paving materials with an initial SR value of at least 0.33\",IF(Instructions!$I$85=1,\" (sq ft)\",\" (sq m)\"))","v":"Area of unshaded paving materials with an initial SR value of at least 0.33 (sq ft)"}]
[null,null,null,{"$f":"CONCATENATE(\"Area of unshaded vegetation in open pavers\",IF(Instructions!$I$85=1,\" (sq ft)\",\" (sq m)\"))","v":"Area of unshaded vegetation in open pavers (sq ft)"}]
[null,null,null,{"$f":"CONCATENATE(\"Remaining hardscape area (not earning credit)\",IF(Instructions!$I$85=1,\" (sq ft)\",\" (sq m)\"))","v":"Remaining hardscape area (not earning credit) (sq ft)"},null,null,null,null,null,null,"HM"]
[]
[null,null,"Roof"]
[null,null,{"$f":"SUM(C50:C52)","v":0},{"$f":"CONCATENATE(\"Total roof area\",IF(Instructions!$I$85=1,\" (sq ft)\",\" (sq m)\"))","v":"Total roof area (sq ft)"},null,null,null,null,null,null,"HM",null,null,null,null,"Verify calculations or estimates related to shaded and/or nonabsorptive areas and conduct on-site verification of shade trees or other plantings and nonabsorptive products. "]
[null,null,null,{"$f":"CONCATENATE(\"Area of qualified roof products, see Table 1 in the rating system for SRI requirements\",IF(Instructions!$I$85=1,\" (sq ft)\",\" (sq m)\"))","v":"Area of qualified roof products, see Table 1 in the rating system for SRI requirements (sq ft)"},null,null,null,null,null,null,"HM",null,null,null,null,"Verify calculations or estimates related to shaded and/or nonabsorptive areas and conduct on-site verification of shade trees or other plantings and nonabsorptive products. "]
[null,null,null,{"$f":"CONCATENATE(\"Area of vegetated roof\",IF(Instructions!$I$85=1,\" (sq ft)\",\" (sq m)\"))","v":"Area of vegetated roof (sq ft)"},null,null,null,null,null,null,"HM"]
[null,null,null,{"$f":"CONCATENATE(\"Remaining roof area (not earning credit)\",IF(Instructions!$I$85=1,\" (sq ft)\",\" (sq m)\"))","v":"Remaining roof area (not earning credit) (sq ft)"}]
[null,null,null,null,null,null,null,null,null,null,"HM"]
[null,null,null,null,null,null,null,null,null,null,"HM"]
[null,null,{"$f":"IFERROR((C50+C51+C43+C44+C45)/(C49+C42),0)","v":0},"Percentage of area with shading or nonabsorptive material (%)",null,null,null,null,null,null,"HM"]
[]
[null,null,"OR"]
[null,null,"Option 2. Tree Planting (1 point)",null,"Y",null,"M",null,"V",null,null,{"$f":"C58","v":"Option 2. Tree Planting (1 point)"}]
[null,null,null,null,null,null,null,null,null,null,"HM"]
[null,null,null,null,null,null,null,null,null,null,"HM"]
[null,null,"(Select one)","Install tree with canopy width of 20 feet, or trees with shading area of 315 square feet.",null,null,null,null,null,null,null,null,null,null,null,"Verify canopy width of 20 feet, or trees with shading area of 315 square feet."]
[]
[null,null,null,null,null,null,null,null,null,null,"HM"]
["SSc2",{"$f":"L64","v":"SS Credit Rainwater Management"},null,null,null,null,null,null,null,null,"HM","SS Credit Rainwater Management"]
[null,null,null,null,null,null,null,null,null,null,"HM"]
[null,"Up to 2 points",null,null,"Preliminary    Y",{"$f":"IF((IF(F71>0,(IF(SUM(F71,F106)>2,2,SUM(F71,F106))),F100)+F106)>2,2,(IF(F71>0,(IF(SUM(F71,F106)>2,2,SUM(F71,F106))),F100)+F106))","v":0},"M",{"$f":"IF((IF(H71>0,(IF(SUM(H71,H106)>2,2,SUM(H71,H106))),H100)+H106)>2,2,(IF(H71>0,(IF(SUM(H71,H106)>2,2,SUM(H71,H106))),H100)+H106))","v":0},"Verified",{"$f":"IF((IF(J71>0,(IF(SUM(J71,J106)>2,2,SUM(J71,J106))),J100)+J106)>2,2,(IF(J71>0,(IF(SUM(J71,J106)>2,2,SUM(J71,J106))),J100)+J106))","v":0},"HM",null,"Responsible Party"]
[null,"Exemplary Performance: For Case 1, manage 80% of all stormwater on-site or the total impermeable area is less than or equal to 33% of Reference Home or for Case 2, meet 90th percentile rainfall event",null,null,null,null,null,null,null,null,"HM"]
[null,null,null,null,null,null,null,null,null,null,"HM"]
[null,null,null,null,null,null,null,null,null,null,"HM"]
[null,null,"Option 1. Rainwater Management (1-2 points)",null,null,null,null,null,null,null,null,{"$f":"C70","v":"Option 1. Rainwater Management (1-2 points)"}]
[null,null,"Case 1. Low Impact Development (1-2 points)",null,"Y",null,"M",null,"V",null,"HM",{"$f":"C71","v":"Case 1. Low Impact Development (1-2 points)"}]
[null,null,null,null,null,null,null,null,null,null,"HM"]
[null,null,null,null,null,null,null,null,null,null,"HM"]
[null,null,"Site Characteristics"]
[null,null,{"$f":"SUM(C78,C84,C85)","v":0},{"$f":"CONCATENATE(\"Total lot area\",IF(Instructions!$I$85=1,\" (sq ft)\",\" (sq m)\"))","v":"Total lot area (sq ft)"}]
[]
[null,null,"Roof"]
[null,null,{"$f":"SUM(C79:C81)","v":0},{"$f":"CONCATENATE(\"Total roof area\",IF(Instructions!$I$85=1,\" (sq ft)\",\" (sq m)\"))","v":"Total roof area (sq ft)"}]
[null,null,null,{"$f":"CONCATENATE(\"Vegetated roof area\",IF(Instructions!$I$85=1,\" (sq ft)\",\" (sq m)\"))","v":"Vegetated roof area (sq ft)"}]
[null,null,null,{"$f":"CONCATENATE(\"Roof area directed to a qualifying infiltration feature\",IF(Instructions!$I$85=1,\" (sq ft)\",\" (sq m)\"))","v":"Roof area directed to a qualifying infiltration feature (sq ft)"}]
[null,null,null,{"$f":"CONCATENATE(\"Remaining roof area (not earning credit)\",IF(Instructions!$I$85=1,\" (sq ft)\",\" (sq m)\"))","v":"Remaining roof area (not earning credit) (sq ft)"}]
[]
[null,null,"Non-roof Site Area"]
[null,null,null,{"$f":"CONCATENATE(\"Total landscape softscape area\",IF(Instructions!$I$85=1,\" (sq ft)\",\" (sq m)\"))","v":"Total landscape softscape area (sq ft)"}]
[null,null,{"$f":"SUM(C86:C89)","v":0},{"$f":"CONCATENATE(\"Total hardscape area (driveways, walkways, patios, etc.)\",IF(Instructions!$I$85=1,\" (sq ft)\",\" (sq m)\"))","v":"Total hardscape area (driveways, walkways, patios, etc.) (sq ft)"}]
[null,null,null,{"$f":"CONCATENATE(\"Permeable paving\",IF(Instructions!$I$85=1,\" (sq ft)\",\" (sq m)\"))","v":"Permeable paving (sq ft)"}]
[null,null,null,{"$f":"CONCATENATE(\"Qualifying open pavers\",IF(Instructions!$I$85=1,\" (sq ft)\",\" (sq m)\"))","v":"Qualifying open pavers (sq ft)"}]
[null,null,null,{"$f":"CONCATENATE(\"Hardscapes directed to qualifying infiltration features\",IF(Instructions!$I$85=1,\" (sq ft)\",\" (sq m)\"))","v":"Hardscapes directed to qualifying infiltration features (sq ft)"}]
[null,null,null,{"$f":"CONCATENATE(\"Remaining hardscape area (not earning credit)\",IF(Instructions!$I$85=1,\" (sq ft)\",\" (sq m)\"))","v":"Remaining hardscape area (not earning credit) (sq ft)"}]
[]
[null,null,"Qualifying area, as a percentage of total lot area",null,null,null,null,null,null,null,"HM"]
[null,null,{"$f":"IFERROR(SUM(C79,C80,C84,C86,C87,C88)/C75,0)","v":0},"Qualifying area, as percentage of total lot area (%)",null,null,null,null,null,null,"HM",null,null,null,null,"Verify calculations of percentage permeable elements and verify calculations identifying percentile storm or 2 year, 24 hour storm."]
[null,null,null,null,null,null,null,null,null,null,"HM"]
[null,null,"Reduction of total impermeable area",null,null,null,null,null,null,null,"HM"]
[null,null,{"$f":"SUM(C81,C89)","v":0},{"$f":"CONCATENATE(\"Total impermeable area of the project\",IF(Instructions!$I$85=1,\" (sq ft)\",\" (sq m)\"))","v":"Total impermeable area of the project (sq ft)"},null,null,null,null,null,null,"HM"]
[null,null,{"$f":"IF(Instructions!F65=\"\",\"\",(VLOOKUP(Instructions!F65,'MRc Construction Waste Mgmt'!A1:B17,2,FALSE)))","v":""},{"$f":"CONCATENATE(\"Reference home size\",IF(Instructions!$I$85=1,\" (sq ft)\",\" (sq m)\"))","v":"Reference home size (sq ft)"},null,null,null,null,null,null,"HM"]
[null,null,{"$f":"IFERROR(C95/C96,0)","v":0},"Impermeable area as a percentage of reference home size",null,null,null,null,null,null,"HM"]
[null,null,null,null,null,null,null,null,null,null,"HM"]
[null,null,"OR",null,null,null,null,null,null,null,"HM"]
[null,null,"Case 2. NPDES Projects (2 points)",null,"Y",null,"M",null,"V",null,"HM",{"$f":"C100","v":"Case 2. NPDES Projects (2 points)"}]
[null,null,null,null,null,null,null,null,null,null,"HM"]
[null,null,null,null,null,null,null,null,null,null,"HM"]
[null,null,null,"Percentile rainfall event",null,null,null,null,null,null,"HM",null,null,null,null,"Verify calculations identifying percentile."]
[]
[null,null,"AND/OR"]
[null,null,"Option 2. Basic Landscape Design (1 point)",null,"Y",null,"M",null,"V",null,null,{"$f":"C106","v":"Option 2. Basic Landscape Design (1 point)"}]
[null,null,null,null,null,null,null,null,null,null,"HM"]
[null,null,null,null,null,null,null,null,null,null,"HM"]
[null,null,"Meet all of the following requirements for all designed landscape softscapes:"]
[null,null,"(Select one)","Do not use turf in densely shaded areas.",null,null,null,null,null,null,null,null,null,null,null,"Verify no turf in densely shaded areas."]
[]
[null,null,"(Select one)","Do not use turf in areas with a slope of 25% (i.e., 4:1 slope) or greater.",null,null,null,null,null,null,null,null,null,null,null,"Verify no turf in areas with a slope of 25% (i.e., 4:1 slope) or greaterIntroduce no invasive plant species into the landscape."]
[]
[null,null,"(Select one)","Introduce no invasive plant species into the landscape.",null,null,null,null,null,null,null,null,null,null,null,"Verify no invasive plant species introduced into the landscape."]
[]
[null,null,"(Select one)","Add mulch or soil amendments as determined by soil testing.",null,null,null,null,null,null,null,null,null,null,null,"Verify mulch or soil amendments added as determined by soil testing."]
[]
[null,null,"(Select one)","All compacted soil (e.g., from construction vehicles) must be tilled to at least 6 inches.",null,null,null,null,null,null,null,null,null,null,null,"Verify all compacted soil (e.g., from construction vehicles) tilled to at least 6 inches."]
[]
["SSc3",{"$f":"L120","v":"SS Credit Nontoxic Pest Control "},null,null,null,null,null,null,null,null,"HM","SS Credit Nontoxic Pest Control "]
[null,null,null,null,null,null,null,null,null,null,"HM"]
[null,"Up to 2 points",null,null,"Preliminary    Y",null,"M",null,"Verified",null,"HM",null,"Responsible Party"]
[null,"Exemplary Performance: Earn more than the maximum 2 points",null,null,null,null,null,null,null,null,"HM"]
[null,null,null,null,null,null,null,null,null,null,"HM"]
[null,null,null,null,null,null,null,null,null,null,"HM"]
[null,null,"Select all of the following that have been included in the project.",null,null,null,null,null,null,null,"HM"]
[null,null,"(Select one)","Install a steel mesh barrier termite control system. (2 points)",null,null,null,null,null,null,"HM"]
[null,null,null,null,null,null,null,null,null,null,"HM"]
[null,null,"(Select one)","Install a physical termite barrier system (e.g., basaltic rock) approved by code. (2 points)",null,null,null,null,null,null,"HM"]
[null,null,null,null,null,null,null,null,null,null,"HM"]
[null,null,"(Select one)","For below-grade walls, use solid concrete foundation walls, masonry walls with a course of solid block bond beam, or concrete-filled block. (1 point)",null,null,null,null,null,null,"HM"]
[null,null,null,null,null,null,null,null,null,null,"HM"]
[null,null,null,null,null,null,null,null,null,null,"HM"]
[null,null,"(Select one)","Install post-tension slabs. (1 point)",null,null,null,null,null,null,"HM"]
[null,null,null,null,null,null,null,null,null,null,"HM"]
[null,null,"(Select one)","Treat all cellulosic structural material (e.g., wood framing) with a registered pesticide containing borates, or meet the manufacturer’s warranty requirements for preconstruction treatment. (1 point)",null,null,null,null,null,null,"HM"]
[null,null,null,null,null,null,null,null,null,null,"HM"]
[null,null,null,null,null,null,null,null,null,null,"HM"]
[null,null,"(Select one)","Use noncellulosic material for all structural elements. (1 point)",null,null,null,null,null,null,"HM"]
[null,null,null,null,null,null,null,null,null,null,"HM"]
[null,null,"(Select one)","Install ports or openings for all plumbing elements that penetrate the slab, to allow access for inspection and treatment of pest infestations. (1 point)",null,null,null,null,null,null,"HM"]
[null,null,null,null,null,null,null,null,null,null,"HM"]
[null,null,null,null,null,null,null,null,null,null,"HM"]
[null,null,"(Select one)","Install a registered termite bait system and provide for ongoing maintenance as required by the manufacturer. (1 point)",null,null,null,null,null,null,"HM"]
[null,null,null,null,null,null,null,null,null,null,"HM"]
[null,null,"(Select one)","Design a minimum 6-inch (150 millimeters) inspection space between the surface of the planned landscape grade and nonmasonry siding. (1 point)",null,null,null,null,null,null,"HM"]
[null,null,null,null,null,null,null,null,null,null,"HM"]
[null,null,null,null,null,null,null,null,null,null,"HM"]
[null,null,"(Select one)","Seal all external cracks, joints, penetrations, edges, and entry points with appropriate caulking. Install rodent- and corrosion-proof screens (e.g., copper or stainless steel mesh) on all openings greater than ¼ inch (6 millimeters), except where code prohibits their installation. (1 point)",null,null,null,null,null,null,"HM"]
[null,null,null,null,null,null,null,null,null,null,"HM"]
[null,null,null,null,null,null,null,null,null,null,"HM"]
[null,null,null,null,null,null,null,null,null,null,"HM"]
[null,null,"(Select one)","Design discharge points for rain gutters, air-conditioning condensation lines, steam vent lines, or any other moisture source such that discharge is at least 24 inches (600 millimeters) from the foundation. (1 point)",null,null,null,null,null,null,"HM"]
[null,null,null,null,null,null,null,null,null,null,"HM"]
[null,null,null,null,null,null,null,null,null,null,"HM"]
[null,null,"(Select one)","Design landscape features to provide a minimum 18-inch (450 millimeters) space between the exterior wall and any plantings. (1 point)",null,null,null,null,null,null,"HM"]
[null,null,null,null,null,null,null,null,null,null,"HM"]
[null,null,"For multifamily projects",null,null,null,null,null,null,null,"HM",{"$f":"C158","v":"For multifamily projects"}]
[null,null,"(Select one)","Develop an integrated pest management policy.  The policy must include guidance for residents on pesticide use, housekeeping and prompt reporting of pest problems and incorporate policy in the Homeowner Education Manual. (Required)",null,null,null,null,null,null,"HM",null,null,null,null,"Conduct on-site verification that credit requirements are met."]
[null,null,null,null,null,null,null,null,null,null,"HM"]

{"sheet":"WE","index":9,"n_rows":86,"n_cols":17,"rows_kept":86,"cut":false,"hidden":false,"merged":[[53,3,53,7],[56,3,56,7],[57,3,57,7],[60,3,60,7],[62,1,62,3],[48,3,48,7],[49,3,49,7],[52,3,52,7],[4,1,4,3],[12,3,12,8],[18,3,18,8],[35,3,35,8],[45,3,45,8],[37,3,38,9],[20,1,20,3],[29,1,29,3],[40,1,40,3]]}
[null,"Water Efficiency",null,null,null,null,null,null,null,null,null,"Notes","Verified \n(initials)","Date \nVerified","QAD Notes","Verification Measure","QAD Notes"]
[]
[null,null,null,null,"Preliminary    Y",{"$f":"IF(WE!$F$32>0,WE!$F$32,SUM(F43,F65))","v":0},"Maybe",{"$f":"IF(WE!$H$32>0,WE!$H$32,SUM(H43,H65))","v":0},"Verified",{"$f":"IF(WE!$J$32>0,WE!$J$32,SUM(J43,J65))","v":0}]
[]
["WEp1",{"$f":"L5","v":"WE Prerequisite Water Use"},null,null,null,null,null,null,null,null,"HM","WE Prerequisite Water Use"]
[]
[null,"Required",null,null,null,"Required",null,null,"Verified",{"$f":"IF(OR(C13=0.2,C13>0.2,C19=3,C19>3),\"Y\",\"N\")","v":"N"},null,null,"Responsible Party"]
[]
[]
[null,null,"Option 1. Total Water Use"]
[null,null,"Reduce total indoor and outdoor water consumption by at least 20% over standard practices"]
[]
[null,null,{"$f":"'Water Reduction Calculator'!I141","v":0},"Total reduction of indoor and outdoor water consumption as calculated in the Water Reduction Calculator (%)"]
[]
[null,null,"OR"]
[null,null,"Option 2. Indoor and Outdoor Water Use"]
[null,null,"Achieve 3 points in WE credit Indoor Water Use and/or WE credit Outdoor Water Use"]
[]
[null,null,{"$f":"J43+J65","v":0},"Total points in WE credit Indoor Water Use and WE credit Outdoor Water Use"]
[]
["WEp1",{"$f":"L21","v":"WE Prerequisite Water Metering"},null,null,null,null,null,null,null,null,"HM","WE Prerequisite Water Metering"]
[null,null,null,null,null,null,null,null,null,null,"HM"]
[null,"Required",null,null,null,"Required",null,null,"Verified",null,"HM",null,"Responsible Party"]
[null,null,null,null,null,null,null,null,null,null,"HM"]
[null,null,null,null,null,null,null,null,null,null,"HM"]
[null,null,"Select one of the following:",null,null,null,null,null,null,null,"HM"]
[null,null,"(Select one)","A whole-house water meter is installed.",null,null,null,null,null,null,"HM",null,null,null,null,"Conduct on-site verification that water meter is installed."]
[null,null,"(Select one)","The house uses only well water and is not connected to a municipal water system.",null,null,null,null,null,null,"HM",null,null,null,null,"Conduct on-site verification that only well water is used."]
[null,null,null,null,null,null,null,null,null,null,"HM"]
["WEc1",{"$f":"L30","v":"WE Credit Total Water Use"},null,null,null,null,null,null,null,null,"HM","WE Credit Total Water Use"]
[null,null,null,null,null,null,null,null,null,null,"HM"]
[null,"3 to 15 points",null,null,"Preliminary    Y",null,"M",null,"Verified",null,"HM",null,"Responsible Party"]
[null,"Exemplary Performance: 85% reduction of indoor and outdoor water consumption",null,null,null,null,null,null,null,null,"HM"]
[null,null,null,null,null,null,null,null,null,null,"HM"]
[null,null,null,null,null,null,null,null,null,null,"HM"]
[null,null,{"$f":"'Water Reduction Calculator'!I141","v":0},"Total reduction of indoor and outdoor water consumption as calculated in the Water Reduction Calculator (%)",null,null,null,null,null,null,"HM",null,null,null,null,"Visually verify that listed indoor fixtures were installed and that water calculator’s inputs match installed fixtures’ performance criteria. Conduct on-site verification that outdoor water use calculator’s inputs match installed fixtures’ performance criteria; conduct on-site verification of any water-saving items identified in calculation, including high-efficiency irrigation measures and high-low shading conditions; and for any drought-tolerant plants, compare list of installed plants with list of regional drought-tolerant plants created by a third-party entity."]
[null,null,null,null,null,null,null,null,null,null,"HM"]
[null,null,"(Select one)","The water pressure has been tested. There are no detectable water leaks. Any installed water softeners are demand initiated.",null,null,null,null,null,null,"HM",null,null,null,null,"Test and record water pressure.  Test for water leaks. Verify installed water softeners are demand initiated."]
[null,null,null,null,null,null,null,null,null,null,"HM"]
[null,null,null,null,null,null,null,null,null,null,"HM"]
["WEc2",{"$f":"L41","v":"WE Credit Indoor Water Use"},null,null,null,null,null,null,null,null,"HM","WE Credit Indoor Water Use"]
[null,null,null,null,null,null,null,null,null,null,"HM"]
[null,"Up to 11 points",null,null,"Preliminary    Y",null,"M",null,"Verified",null,"HM",null,"Responsible Party"]
[null,null,null,null,null,null,null,null,null,null,"HM"]
[null,null,null,null,null,null,null,null,null,null,"HM"]
[null,null,"(Select one)","The water pressure has been tested. There are no detectable water leaks. Any installed water softeners are demand initiated.",null,null,null,null,null,null,"HM",null,null,null,null,"Test and record water pressure.  Test for water leaks. "]
[null,null,"Meet any of the following:",null,null,null,null,null,null,null,"HM"]
[null,null,"Lavatory Faucet (2-3 points)",null,null,null,null,null,null,null,"HM",{"$f":"C48","v":"Lavatory Faucet (2-3 points)"}]
[null,null,"(Select one)","All installed lavatory faucets and/or faucet aerators are WaterSense labeled.",null,null,null,null,null,null,"HM",null,null,null,null,"Conduct on-site verification that faucets are installed, comparing installed items with manufacturers’ specification sheets where necessary; ensure all items are WaterSense labeled."]
[null,null,null,{"$f":"CONCATENATE(\"Average rated flow volume across all lavatory faucets\",IF(Instructions!$I$85=1,\" (gpm)\",\" (lpm)\"))","v":"Average rated flow volume across all lavatory faucets (gpm)"},null,null,null,null,null,null,"HM",null,null,null,null,"Verify average rated flow."]
[null,null,null,null,null,null,null,null,null,null,"HM"]
[null,null,"Showerheads (1-3 points)",null,null,null,null,null,null,null,"HM",{"$f":"C52","v":"Showerheads (1-3 points)"}]
[null,null,"(Select one)","All installed showerhead fixtures and fittings are WaterSense labeled.",null,null,null,null,null,null,"HM",null,null,null,null,"Conduct on-site verification that showerheads are installed, comparing installed items with manufacturers’ specification sheets where necessary; ensure all items are WaterSense labeled."]
[null,null,null,{"$f":"CONCATENATE(\"Total rated flow volume per shower compartment, averaged across all shower compartments\",IF(Instructions!$I$85=1,\" (gpm)\",\" (lpm)\"))","v":"Total rated flow volume per shower compartment, averaged across all shower compartments (gpm)"},null,null,null,null,null,null,"HM",null,null,null,null,"Verify average rated flow."]
[null,null,null,null,null,null,null,null,null,null,"HM"]
[null,null,"Toilets (1-3 points)",null,null,null,null,null,null,null,"HM",{"$f":"C56","v":"Toilets (1-3 points)"}]
[null,null,"(Select one)","All installed toilet fixtures and fittings are WaterSense labeled.",null,null,null,null,null,null,"HM",null,null,null,null,"Conduct on-site verification that high-efficiency toilets are installed, comparing installed items with manufacturers’ specification sheets where necessary; ensure all items are WaterSense labeled."]
[null,null,null,{"$f":"CONCATENATE(\"Average rated flush volume across all toilets\",IF(Instructions!$I$85=1,\" (gpf)\",\" (lpf)\"))","v":"Average rated flush volume across all toilets (gpf)"},null,null,null,null,null,null,"HM",null,null,null,null,"Verify average rated flow."]
[null,null,null,null,null,null,null,null,null,null,"HM"]
[null,null,"Clothes Washers (2 points)",null,null,null,null,null,null,null,"HM",{"$f":"C60","v":"Clothes Washers (2 points)"}]
[null,null,"(Select one)","All clothes washers are ENERGY STAR qualified or performance equivalent",null,null,null,null,null,null,"HM",null,null,null,null,"Conduct on-site verification that clothes washers are installed, comparing installed items with manufacturers’ specification sheets where necessary; ensure all items are ENERGY STAR  labeled."]
[null,null,null,null,null,null,null,null,null,null,"HM"]
["WEc3",{"$f":"L63","v":"WE Credit Outdoor Water Use"},null,null,null,null,null,null,null,null,"HM","WE Credit Outdoor Water Use"]
[null,null,null,null,null,null,null,null,null,null,"HM"]
[null,"Up to 4 points",null,null,"Preliminary    Y",{"$f":"IF(F68>0,F68,F72)","v":0},"M",{"$f":"IF(H68>0,H68,H72)","v":0},"Verified",{"$f":"IF(J68>0,J68,J72)","v":0},"HM",null,"Responsible Party"]
[null,null,null,null,null,null,null,null,null,null,"HM"]
[null,null,null,null,null,null,null,null,null,null,"HM"]
[null,null,"Option 1. Efficient Landscaping (1-4 points)",null,"Y",null,"M",null,"V",null,null,{"$f":"C68","v":"Option 1. Efficient Landscaping (1-4 points)"}]
[null,null,null,"Native or adapted plant area as a percentage of total landscape softscape area (%)",null,null,null,null,null,null,"HM",null,null,null,null,"For all native or adapted plants, compare list of installed plants with list of regional native and adapted plants created by third-party entity "]
[]
[null,null,"OR"]
[null,null,"Option 2. Efficient Irrigation (1-2 points)",null,"Y",null,"M",null,"V",null,null,{"$f":"C72","v":"Option 2. Efficient Irrigation (1-2 points)"}]
[null,null,null,null,null,null,null,null,null,null,"HM"]
[null,null,"Design and install a high-efficiency irrigation such that any of the following are met (1 point per measure):"]
[]
[null,null,"(Select one)","Use of pressure regulation for every zone (valve or sprinkler)",null,null,null,null,null,null,null,null,null,null,null,"Verify use of pressure regulation for every zone (valve or sprinkler)"]
[]
[null,null,"(Select one)","Use of check valves on sloped irrigation zones, where needed to prevent low head drainage",null,null,null,null,null,null,null,null,null,null,null,"Verify use of check valves on sloped irrigation zones, where needed to prevent low head drainage"]
[]
[null,null,"(Select one)","Flow sensing with a master valve and irrigation controller that responds to a high-flow occurrence",null,null,null,null,null,null,null,null,null,null,null,"Verify flow sensing with a master valve and irrigation controller that responds to a high-flow occurrence"]
[]
[null,null,"(Select one)","Use of smart irrigation control technology (weather based, soil moisture sensors, rain sensors, etc.) ",null,null,null,null,null,null,null,null,null,null,null,"Verify use of smart irrigation control technology (weather based, soil moisture sensors, rain sensors, etc.) "]
[]
[null,null,"(Select one)","Create separate zones for each type of bedding area based on watering needs",null,null,null,null,null,null,null,null,null,null,null,"Verify separate zones created for each type of bedding area based on watering needs"]
[]
[null,null,"(Select one)","Use of drip irrigation for at least 50% of planting area",null,null,null,null,null,null,null,null,null,null,null,"Verify use of drip irrigation for at least 50% of planting area"]

{"sheet":"EA","index":10,"n_rows":190,"n_cols":17,"rows_kept":190,"cut":false,"hidden":false,"merged":[[178,1,178,9],[168,2,168,3],[170,2,170,3],[172,2,172,7],[173,2,173,8],[163,1,163,3],[113,3,113,8],[92,3,92,8],[96,3,98,9],[41,3,42,9],[141,2,142,3],[94,3,94,9],[149,2,150,3],[55,3,55,7],[100,3,101,9],[111,3,112,9],[83,1,83,3],[126,3,126,8],[128,3,128,9],[130,3,132,9],[134,3,135,9],[4,1,4,3],[27,1,27,3],[36,1,36,3],[45,1,45,3],[54,3,54,7],[11,3,11,7],[13,3,13,7],[14,3,14,7],[43,3,43,8],[19,3,19,7],[20,3,20,7],[21,3,21,7],[25,3,25,7]]}
[null,"Energy and Atmosphere",null,null,null,null,null,null,null,null,null,"Notes","Verified \n(initials)","Date \nVerified","QAD Notes","Verification Measure","QAD Notes"]
[]
[null,null,null,null,"Preliminary    Y",{"$f":"SUM(F48,F86,F166,F178)","v":0},"Maybe",{"$f":"SUM(H48,H86,H166,H178)","v":0},"Verified",{"$f":"SUM(J48,J86,J166,J178)","v":0}]
[]
["EAp1",{"$f":"L5","v":"EA Prerequisite Minimum Energy Performance"},null,null,null,null,null,null,null,null,"HM","EA Prerequisite Minimum Energy Performance"]
[null,null,null,null,null,null,null,null,null,null,"HM"]
[null,"Required",null,null,null,"Required",null,null,"Verified","N","HM",null,"Responsible Party"]
[null,null,null,null,null,null,null,null,null,null,"HM"]
[null,null,null,null,null,null,null,null,null,null,"HM"]
[null,null,"1. ENERGY STAR for Homes version 3",null,null,null,null,null,null,null,"H",{"$f":"C10","v":"1. ENERGY STAR for Homes version 3"}]
[null,null,null,null,null,null,null,null,null,null,"H"]
[null,null,"(Select one)","ENERGY STAR version 3 checklists are complete",null,null,null,null,null,null,"H",null,null,null,null,"Upload energy model file AND upload ENERGY STAR for Homes pdf report demonstrating that project meets ENERGY STAR for Homes requirements; OR upload builders’ option package to demonstrate compliance with prescriptive ENERGY STAR for Homes requirements. Conduct on-site verification of required ENERGY STAR for Homes inspection and upload ENERGY STAR for Homes inspection checklist."]
[null,null,null,null,null,null,null,null,null,null,"H"]
[null,null,null,"HERS Index Rating",null,null,null,null,null,null,"H",null,null,null,null,"Verify HERS index"]
[null,null,null,"ENERGY STAR HERS Index Target (SAF Adjusted)",null,null,null,null,null,null,"H"]
[null,null,null,null,null,null,null,null,null,null,"H"]
[null,null,"2. ENERGY STAR Qualified Appliances",null,null,null,null,null,null,null,"H",{"$f":"C17","v":"2. ENERGY STAR Qualified Appliances"}]
[null,null,null,null,null,null,null,null,null,null,"H"]
[null,null,"Select at least one of the following:",null,null,null,null,null,null,null,"H",null,null,null,null,"Verify appliance(s) is installed."]
[null,null,"(Select one)","ENERGY STAR refrigerator is installed.",null,null,null,null,null,null,"H"]
[null,null,"(Select one)","ENERGY STAR dishwasher is installed.",null,null,null,null,null,null,"H"]
[null,null,"(Select one)","ENERGY STAR clothes washer is installed.",null,null,null,null,null,null,"H"]
[null,null,null,null,null,null,null,null,null,null,"H"]
[null,null,"3. Duct Runs",null,null,null,null,null,null,null,"H",{"$f":"C24","v":"3. Duct Runs"}]
[null,null,null,null,null,null,null,null,null,null,"H"]
[null,null,"(Select one)","All duct runs are fully ducted.",null,null,null,null,null,null,"H",null,null,null,null,"Verify duct runs are fully ducted"]
[null,null,null,null,null,null,null,null,null,null,"H"]
["EAp2",{"$f":"L28","v":"EA Prerequisite Energy Metering"},null,null,null,null,null,null,null,null,"HM","EA Prerequisite Energy Metering"]
[null,null,null,null,null,null,null,null,null,null,"HM"]
[null,"Required",null,null,null,"Required",null,null,"Verified",null,"HM",null,"Responsible Party"]
[null,null,null,null,null,null,null,null,null,null,"HM"]
[null,null,null,null,null,null,null,null,null,null,"HM"]
[null,null,"(Select one)","A whole-house electric meter is installed.",null,null,null,null,null,null,"HM",null,null,null,null,"Conduct on-site verification that applicable utility meter is installed."]
[null,null,"(Select one)","A whole-house gas meter is installed.",null,null,null,null,null,null,"HM",null,null,null,null,"Conduct on-site verification that applicable utility meter is installed."]
[null,null,null,null,null,null,null,null,null,null,"HM"]
[null,null,null,null,null,null,null,null,null,null,"HM"]
["EAp3",{"$f":"L37","v":"EA Prerequisite Education of Homeowner, Tenant, or Building Manager"},null,null,null,null,null,null,null,null,"HM","EA Prerequisite Education of Homeowner, Tenant, or Building Manager"]
[null,null,null,null,null,null,null,null,null,null,"HM"]
[null,"Required",null,null,null,"Required",null,null,"Verified",null,"HM",null,"Responsible Party"]
[null,null,null,null,null,null,null,null,null,null,"HM"]
[null,null,null,null,null,null,null,null,null,null,"HM"]
[null,null,"(Select one)","An operations and maintenance manual, binder, or CD has been/will be provided to all individuals or organizations responsible for the maintenance of the home.",null,null,null,null,null,null,"HM",null,null,null,null,"Verify that operations and maintenance manual includes required elements."]
[null,null,null,null,null,null,null,null,null,null,"HM"]
[null,null,"(Select one)","A minimum one-hour walkthrough of the home with the occupants has been conducted.",null,null,null,null,null,null,"HM",null,null,null,null,"Verify that building walkthrough was performed."]
[null,null,null,null,null,null,null,null,null,null,"HM"]
["EAc1",{"$f":"L46","v":"EA Credit Annual Energy Use"},null,null,null,null,null,null,null,null,"H","EA Credit Annual Energy Use"]
[null,null,null,null,null,null,null,null,null,null,"H"]
[null,"Up to 36 points",null,null,"Preliminary    Y",{"$f":"IF(F52>0,F52,F61)","v":0},"M",{"$f":"IF(H52>0,H52,H61)","v":0},"Verified",{"$f":"IF(Instructions!F25=\"New Construction\",IF(EA!J52>EA!J61,EA!J52,EA!J61),EA!J61)","v":""},"H",null,"Responsible Party"]
[null,"Exemplary Performance: For Option 1, 100% reduction; For Option 2, -10 HERS Index Rating.",null,null,null,null,null,null,null,null,"H"]
[null,null,null,null,null,null,null,null,null,null,"H"]
[null,null,null,null,null,null,null,null,null,null,"H"]
[null,null,"Option 1. LEED Energy Budget (1-36 points)",null,"Y",null,"M",null,"V",{"$f":"IF(Instructions!F25=\"\",\"\",IF(Instructions!F25=\"New Construction\",C58,\"\"))","v":""},"H",{"$f":"C52","v":"Option 1. LEED Energy Budget (1-36 points)"}]
[null,null,null,null,null,null,null,null,null,null,"H"]
[null,null,null,null,null,null,null,null,null,null,"H"]
[null,null,null,"LEED Reference Energy Budget (MMBtu/year)",null,null,null,null,null,null,"H",null,null,null,null,"Verify energy model output demonstrating energy savings from energy model."]
[null,null,null,"As Designed Energy Budget (MMBtu/year)",null,null,null,null,null,null,"H"]
[null,null,{"$f":"IFERROR(FLOOR(1-C56/C55,0.01),\"\")","v":""},"Percent reduction below LEED Energy Budget (%)",null,null,null,null,null,null,"H"]
[null,null,{"$f":"IF(OR(C55=\"\",C56=\"\"),0,IFERROR(VLOOKUP(C57,'EA Lowrise'!H:I,2),0))","v":0},"Total Points"]
[null,null,null,null,null,null,null,null,null,null,"H"]
[null,null,"OR",null,null,null,null,null,null,null,"H"]
[null,null,"Option 2. HERS Index (SAF Adjusted) (1-36 points)",null,"Y",null,"M",null,"V",{"$f":"IF(Instructions!F25=\"\",\"\",MAX(C70,C75,C82))","v":""},"H",{"$f":"C61","v":"Option 2. HERS Index (SAF Adjusted) (1-36 points)"}]
[null,null,null,null,null,null,null,null,null,null,"H"]
[]
[null,null,null,null,null,null,null,null,null,null,"H"]
[null,null,"Case 1: New Construction"]
[]
[null,null,{"$f":"IF(C14=\"\",\"\",C14)","v":""},"HERS Index Rating"]
[null,null,null,"Size Adjustment Factor (SAF) from the ENERGY STAR for Homes Report",null,null,null,null,null,null,null,null,null,null,null,"Verify Size Adjustment factor (SAF)"]
[null,null,{"$f":"IFERROR(ROUND(C67/C68,0),0)","v":0},"HERS Index (SAF Adjusted)"]
[null,null,{"$f":"IF(OR(C67=\"\",C68=\"\"),0,IF(C14<0,36,(IFERROR(VLOOKUP(C69,'EA Lowrise'!N:O,2,FALSE),0))))","v":0},"Points for achieving HERS Index Rating"]
[]
[null,null,{"$f":"IF(C15=\"\",\"\",C15)","v":""},"ENERGY STAR HERS Index Target (SAF Adjusted)"]
[null,null,{"$f":"C69","v":0},"HERS Index (SAF Adjusted)"]
[null,null,{"$f":"IFERROR(C72-C73,\"\")","v":""},"HERS Index points below ENERGY STAR HERS Index Target (SAF Adjusted)"]
[null,null,{"$f":"IFERROR(VLOOKUP(C74,'EA Lowrise'!K1:L1500,2,FALSE),0)","v":0},"Points for HERS points below ENERGY STAR HERS Index Target (SAF Adjusted)"]
[]
[null,null,"Case 2: Major Renovation"]
[]
[null,null,{"$f":"IF(C14=\"\",\"\",C14)","v":""},"HERS Index Rating"]
[null,null,null,"Size Adjustment Factor (SAF) from the ENERGY STAR for Homes Report"]
[null,null,{"$f":"IFERROR(ROUND(C79/C80,0),0)","v":0},"HERS Index (SAF Adjusted)"]
[null,null,{"$f":"IF(OR(C79=\"\",C80=\"\"),0,IF(C14<0,36,(IFERROR(VLOOKUP(C81,'EA Lowrise'!Q:R,2,FALSE),0))))","v":0},"Points for achieving HERS Index Rating"]
[]
["EAc2",{"$f":"L84","v":"EA Credit Efficient Hot Water Distribution System"},null,null,null,null,null,null,null,null,"HM","EA Credit Efficient Hot Water Distribution System"]
[null,null,null,null,null,null,null,null,null,null,"HM"]
[null,"Up to 2 points",null,null,"Preliminary    Y",{"$f":"IF(F89>0,F89+F159,F123+F159)","v":0},"M",{"$f":"IF(H89>0,H89+H159,H123+H159)","v":0},"Verified",{"$f":"IF(J89>0,J89+J159,J123+J159)","v":0},"HM",null,"Responsible Party"]
[null,null,null,null,null,null,null,null,null,null,"HM"]
[null,null,null,null,null,null,null,null,null,null,"HM"]
[null,null,"Option 1. Efficient Hot Water Distribution (1 point)",null,"Y",{"$f":"IF(F107>0,F107,F117)","v":0},"M",{"$f":"IF(H107>0,H107,H117)","v":0},"V",{"$f":"IF(J107>0,J107,J117)","v":0},"HM",{"$f":"C89","v":"Option 1. Efficient Hot Water Distribution (1 point)"}]
[null,null,null,null,null,null,null,null,null,null,"HM"]
[null,null,null,null,null,null,null,null,null,null,"HM"]
[null,null,"For projects using circulating systems",null,null,null,null,null,null,null,"HM",{"$f":"C92","v":"For projects using circulating systems"}]
[null,null,"(Select one)","Circulating pump does not operate continuously, is on a timer, or is on a water temperature sensor.",null,null,null,null,null,null,"HM",null,null,null,null,"Verify circulating pump does not operate continuously, on a timer, or on a water temperature sensor."]
[null,null,null,null,null,null,null,null,null,null,"HM"]
[null,null,"(Select one)","Circulating pump is demand activated by a momentary contact switch, motion sensor, flow switch, door switch or voice command.",null,null,null,null,null,null,"HM",null,null,null,null,"Verify circulating pump is demand activated by a momentary contact switch, motion sensor, flow switch, door switch or voice command."]
[null,null,null,null,null,null,null,null,null,null,"HM"]
[null,null,"(Select one)","After the pump starts, the controls allow the pump to operate until the water temperature in the return pipe rises not more than 10ºF (6 ºC) above the initial temperature of the water in the pipe.  Controls limit the water temperature to a maximum of 105ºF (40 ºC). Controls limit pump operation to not more than 5 minutes per activation in the event that both means of shutting off the pump have failed.",null,null,null,null,null,null,"HM"]
[null,null,null,null,null,null,null,null,null,null,"HM"]
[null,null,null,null,null,null,null,null,null,null,"HM"]
[null,null,null,null,null,null,null,null,null,null,"HM"]
[null,null,"(Select one)","Circulating hot water systems have with an automatic or readily accessible manual switch to turn off the hot water circulating pump when not in use. ",null,null,null,null,null,null,"HM"]
[null,null,null,null,null,null,null,null,null,null,"HM"]
[null,null,null,null,null,null,null,null,null,null,"HM"]
[null,null,"For projects using heat-traced piping systems",null,null,null,null,null,null,null,"HM",{"$f":"C104","v":"For projects using heat-traced piping systems"}]
[null,null,"(Select one)","Piping is insulated.",null,null,null,null,null,null,"HM",null,null,null,null,"If system uses heat traced piping, verify piping is insulated."]
[null,null,null,null,null,null,null,null,null,null,"HM"]
[null,null,"Path 1. Maximum Allowable Pipe Length (1 point)",null,"Y",null,"M",null,"V",null,"HM",{"$f":"C107","v":"Path 1. Maximum Allowable Pipe Length (1 point)"}]
[null,null,null,null,null,null,null,null,null,null,"HM"]
[null,null,null,null,null,null,null,null,null,null,"HM"]
[null,null,null,{"$f":"CONCATENATE(\"Pipe or tube length installed\",IF(Instructions!$I$85=1,\" (ft)\",\" (m)\"))","v":"Pipe or tube length installed (ft)"},null,null,null,null,null,null,"HM",null,null,null,null,"Conduct on-site verification that installed hot water distribution system meets requirements for plumbing run lengths and diameter."]
[null,null,null,{"$f":"CONCATENATE(\"Nominal pipe size\",IF(Instructions!$I$85=1,\" (in)\",\" (mm)\"))","v":"Nominal pipe size (in)"},null,null,null,null,null,null,"HM"]
[null,null,{"$f":"IFERROR(IF(Instructions!$I$85=1,LOOKUP(C111,Instructions!$I$89:$I$99,Instructions!$J$89:$J$99),LOOKUP(C111,Instructions!$I$101:$I$111,Instructions!$J$101:$J$111)),\"\")","v":""},{"$f":"CONCATENATE(\"Maximum pipe or tube length allowed for water heaters, boilers with no circulation loop or heat traced pipe or in multifamily buildings a central circulation loop or heat traced pipe\",IF(Instructions!$I$85=1,\" (ft)\",\" (m)\"))","v":"Maximum pipe or tube length allowed for water heaters, boilers with no circulation loop or heat traced pipe or in multifamily buildings a central circulation loop or heat traced pipe (ft)"},null,null,null,null,null,null,"HM"]
[null,null,null,null,null,null,null,null,null,null,"HM"]
[null,null,{"$f":"IFERROR(IF(Instructions!$I$85=1,LOOKUP(C111,Instructions!$I$89:$I$99,Instructions!$K$89:K$99),LOOKUP(C111,Instructions!$I$101:$I$111,Instructions!$K$101:$K$111)),\"\")","v":""},{"$f":"CONCATENATE(\"Maximum pipe or tube length allowed for circulation loop or heat traced pipe serving a single unit or house\",IF(Instructions!$I$85=1,\" (ft)\",\" (m)\"))","v":"Maximum pipe or tube length allowed for circulation loop or heat traced pipe serving a single unit or house (ft)"},null,null,null,null,null,null,"HM"]
[null,null,null,null,null,null,null,null,null,null,"HM"]
[null,null,"OR",null,null,null,null,null,null,null,"HM"]
[null,null,"Path 2. Maximum Allowable Pipe Volume (1 point)",null,"Y",null,"M",null,"V",null,"HM",{"$f":"C117","v":"Path 2. Maximum Allowable Pipe Volume (1 point)"}]
[null,null,null,null,null,null,null,null,null,null,"HM"]
[null,null,null,null,null,null,null,null,null,null,"HM"]
[null,null,null,{"$f":"CONCATENATE(\"Volume of hot or tempered water from source to termination\",IF(Instructions!$I$85=1,\" (oz)\",\" (L)\"))","v":"Volume of hot or tempered water from source to termination (oz)"},null,null,null,null,null,null,"HM",null,null,null,null,"Conduct on-site verification that installed hot water distribution system meets requirements for plumbing run lengths and diameter."]
[null,null,null,null,null,null,null,null,null,null,"HM"]
[null,null,"OR",null,null,null,null,null,null,null,"HM"]
[null,null,"Option 2. Performance Test (1 point)",null,"Y",{"$f":"IF(F142>0,F142,F150)","v":0},"M",{"$f":"IF(H142>0,H142,H150)","v":0},"V",{"$f":"IF(J142>0,J142,J150)","v":0},"HM",{"$f":"C123","v":"Option 2. Performance Test (1 point)"}]
[null,null,null,null,null,null,null,null,null,null,"HM"]
[null,null,null,null,null,null,null,null,null,null,"HM"]
[null,null,"For projects using circulating systems",null,null,null,null,null,null,null,"HM",{"$f":"C126","v":"For projects using circulating systems"}]
[null,null,"(Select one)","Circulating pump does not operate continuously, is on a timer, or is on a water temperature sensor.",null,null,null,null,null,null,"HM",null,null,null,null,"Verify circulating pump does not operate continuously, on a timer, or on a water temperature sensor."]
[null,null,null,null,null,null,null,null,null,null,"HM"]
[null,null,"(Select one)","Circulating pump is demand activated by a momentary contact switch, motion sensor, flow switch, door switch or voice command.",null,null,null,null,null,null,"HM",null,null,null,null,"Verify circulating pump is demand activated by a momentary contact switch, motion sensor, flow switch, door switch or voice command."]
[null,null,null,null,null,null,null,null,null,null,"HM"]
[null,null,"(Select one)","After the pump starts, the controls allow the pump to operate until the water temperature in the return pipe rises not more than 10ºF (6 ºC) above the initial temperature of the water in the pipe.  Controls limit the water temperature to a maximum of 105ºF (40 ºC). Controls limit pump operation to not more than 5 minutes per activation in the event that both means of shutting off the pump have failed.",null,null,null,null,null,null,"HM"]
[null,null,null,null,null,null,null,null,null,null,"HM"]
[null,null,null,null,null,null,null,null,null,null,"HM"]
[null,null,null,null,null,null,null,null,null,null,"HM"]
[null,null,"(Select one)","Circulating hot water systems have with an automatic or readily accessible manual switch to turn off the hot water circulating pump when not in use. ",null,null,null,null,null,null,"HM"]
[null,null,null,null,null,null,null,null,null,null,"HM"]
[null,null,null,null,null,null,null,null,null,null,"HM"]
[null,null,"For projects using heat-traced piping systems",null,null,null,null,null,null,null,"HM",{"$f":"C138","v":"For projects using heat-traced piping systems"}]
[null,null,"(Select one)","Piping is insulated.",null,null,null,null,null,null,"HM",null,null,null,null,"If system uses heat traced piping, verify piping is insulated."]
[null,null,null,null,null,null,null,null,null,null,"HM"]
[null,null,"Note: Projects using heat traces that serve a single unit or house are awarded only half credit.",null,null,null,null,null,null,null,"HM"]
[null,null,"Case 1. Hot water source is a water heater or boiler with no circulation loop or heat traced pipe; or in multifamily buildings a central circulation loop or heat traced pipe.",null,"Y",null,"M",null,"V",null,"HM",{"$f":"C142","v":"Case 1. Hot water source is a water heater or boiler with no circulation loop or heat traced pipe; or in multifamily buildings a central circulation loop or heat traced pipe."}]
[]
[null,null,null,null,null,null,null,null,null,null,"HM"]
[null,null,"(Select one)","Meets WaterSense Labeled New Homes requirements",null,null,null,null,null,null,"HM",null,null,null,null,"Verify project meets WaterSense Labeled New Homes requirements"]
[null,null,null,null,null,null,null,null,null,null,"HM"]
[null,null,null,{"$f":"CONCATENATE(\"Tested volume of water stored in piping\",IF(Instructions!$I$85=1,\" (gal)\",\" (L)\"))","v":"Tested volume of water stored in piping (gal)"},null,null,null,null,null,null,"HM",null,null,null,null,"Conduct test to determine volume of water in hot water plumbing runs."]
[null,null,null,null,null,null,null,null,null,null,"HM"]
[null,null,"OR",null,null,null,null,null,null,null,"HM"]
[null,null,"Case 2. Hot water source is a circulation loop or heat traced pipe serving a single unit or house",null,"Y",null,"M",null,"V",null,"HM",{"$f":"C150","v":"Case 2. Hot water source is a circulation loop or heat traced pipe serving a single unit or house"}]
[]
[null,null,null,null,null,null,null,null,null,null,"HM"]
[null,null,null,{"$f":"CONCATENATE(\"Tested volume of water stored in piping\",IF(Instructions!$I$85=1,\" (gal)\",\" (L)\"))","v":"Tested volume of water stored in piping (gal)"},null,null,null,null,null,null,"HM",null,null,null,null,"Conduct test to determine volume of water in hot water plumbing runs."]
[null,null,null,null,null,null,null,null,null,null,"HM"]
[null,null,"For projects using heat-traced piping systems",null,null,null,null,null,null,null,"HM",{"$f":"C155","v":"For projects using heat-traced piping systems"}]
[null,null,"(Select one)","Piping is insulated.",null,null,null,null,null,null,"HM",null,null,null,null,"If system uses heat traced piping, verify piping is insulated."]
[null,null,null,null,null,null,null,null,null,null,"HM"]
[null,null,"AND/OR",null,null,null,null,null,null,null,"HM"]
[null,null,"Option 3. Pipe Insulation (1 point)",null,"Y",null,"M",null,"V",null,"HM",{"$f":"C159","v":"Option 3. Pipe Insulation (1 point)"}]
[null,null,null,null,null,null,null,null,null,null,"HM"]
[null,null,null,null,null,null,null,null,null,null,"HM"]
[null,null,null,"Insulation R-value",null,null,null,null,null,null,"HM",null,null,null,null,"Conduct on-site verification that installed hot water distribution system meets requirements for pipe insulation."]
[null,null,null,null,null,null,null,null,null,null,"HM"]
["EAc5",{"$f":"L164","v":"EA Credit HVAC Start-Up Credentialing"},null,null,null,null,null,null,null,null,"H","EA Credit HVAC Start-Up Credentialing"]
[null,null,null,null,null,null,null,null,null,null,"H"]
[null,"1 point",null,null,"Preliminary    Y",0,"M",0,"Verified",0,"H",null,"Responsible Party"]
[null,null,null,null,null,null,null,null,null,null,"H"]
[null,null,null,null,null,null,null,null,null,null,"H"]
[null,null,null,null,"Name of technician",null,null,null,null,null,"H",null,null,null,null,"Verify that contractor who performed start-up work and completed installation checklists meets credit requirements. "]
[null,null,null,null,null,null,null,null,null,null,"H"]
[null,null,null,null,"Company of technician",null,null,null,null,null,"H"]
[null,null,null,null,null,null,null,null,null,null,"H"]
[null,null,"Technician commissioning all heating, cooling, and ventilation systems has the following credential",null,null,null,null,null,null,null,"H"]
[null,null,null,null,null,null,null,null,null,null,"H"]
[null,null,null,null,null,null,null,null,null,null,"H"]
[null,"EA Credit Refrigerant Management",null,null,null,null,null,null,null,null,null,{"$f":"B176","v":"EA Credit Refrigerant Management"}]
[]
[null,"1 point",null,null,"Preliminary    Y",0,"M",0,"Verified",0,null,null,"Responsible Party"]
[null,"Exemplary Performance: Do not use refrigerants, or use only refrigerants that have an ozone depletion potential (ODP) of zero and a global warming potential (GWP) of less than 50."]
[]
[null,null,"Option 1. Refrigerant Selection"]
[]
[null,null,null,"Refrigerant used"]
[]
[null,null,"OR",null,null,null,null,null,null,null,null,null,null,null,null,"Verify refrigerant used"]
[null,null,"Option 2. Calculation Approach"]
[]
[null,null,null,"System type"]
[null,null,null,"Refrigerant"]
[null,null,null,"Maximum refrigerant charge or weighted average ratio of refrigerant charge"]

{"sheet":"EA Lowrise","index":11,"n_rows":1002,"n_cols":18,"rows_kept":1002,"cut":false,"hidden":true,"merged":[]}
["HERS index","Points",null,"Percentage reduction","Floor","Points",null,"Annual Energy Use Option 1 Percentage","Annual Energy Use Option 1 Points",null,"Points below HERS Index Target (SAF Adjusted)","Points",null,"HERS Index","Points",null,"HERS Index","Points"]
[0,29,null,0,{"$f":"FLOOR(D2,0.001)","v":0},0,null,0.01,1,null,0,10,null,70,10,null,84,1]
[1,28,null,1E-3,{"$f":"FLOOR(D3,0.001)","v":1E-3},0,null,0.02,2,null,1,11,null,69,11,null,83,1]
[2,28,null,2E-3,2E-3,0,null,0.03,3,null,2,12,null,68,12,null,82,2]
[3,28,null,3.0000000000000001E-3,3.0000000000000001E-3,0,null,0.04,4,null,3,13,null,67,13,null,81,2]
[4,28,null,4.0000000000000001E-3,4.0000000000000001E-3,0,null,0.05,5,null,4,14,null,66,14,null,80,3]
[5,28,null,5.0000000000000001E-3,5.0000000000000001E-3,0,null,0.06,6,null,5,15,null,65,15,null,79,3]
[6,27,null,6.0000000000000001E-3,6.0000000000000001E-3,0,null,7.0000000000000007E-2,7,null,6,16,null,64,16,null,78,4]
[7,27,null,7.0000000000000001E-3,7.0000000000000001E-3,0,null,0.08,8,null,7,17,null,63,17,null,77,4]
[8,27,null,8.0000000000000002E-3,8.0000000000000002E-3,0,null,0.09,9,null,8,18,null,62,18,null,76,5]
[9,27,null,8.9999999999999993E-3,9.0000000000000011E-3,0,null,0.1,10,null,9,19,null,61,19,null,75,5]
[10,27,null,0.01,0.01,1,null,0.11,11,null,10,20,null,60,20,null,74,6]
[11,26,null,1.0999999999999999E-2,1.0999999999999999E-2,1,null,0.12,12,null,11,21,null,59,21,null,73,7]
[12,26,null,1.2E-2,1.2E-2,1,null,0.13,13,null,12,22,null,58,22,null,72,8]
[13,26,null,1.2999999999999999E-2,1.3000000000000001E-2,1,null,0.14000000000000001,14,null,13,22,null,57,22,null,71,9]
[14,26,null,1.4E-2,1.4E-2,1,null,0.15,15,null,14,23,null,56,23,null,70,10]
[15,26,null,1.4999999999999999E-2,1.4999999999999999E-2,1,null,0.16,16,null,15,23,null,55,23,null,69,11]
[16,25,null,1.6E-2,1.6E-2,1,null,0.17,17,null,16,24,null,54,24,null,68,12]
[17,25,null,1.7000000000000001E-2,1.7000000000000001E-2,1,null,0.18,18,null,17,24,null,53,24,null,67,13]
[18,25,null,1.7999999999999999E-2,1.8000000000000002E-2,1,null,0.19,19,null,18,25,null,52,25,null,66,14]
[19,25,null,1.9E-2,1.9E-2,1,null,0.2,20,null,19,25,null,51,25,null,65,15]
[20,25,null,0.02,0.02,2,null,0.21,21,null,20,26,null,50,26,null,64,16]
[21,24,null,2.1000000000000001E-2,2.1000000000000001E-2,2,null,0.22,21,null,21,26,null,49,26,null,63,17]
[22,24,null,2.1999999999999999E-2,2.1999999999999999E-2,2,null,0.23,22,null,22,26,null,48,26,null,62,18]
[23,24,null,2.3E-2,2.3E-2,2,null,0.24,22,null,23,26,null,47,26,null,61,19]
[24,24,null,2.4E-2,2.4E-2,2,null,0.25,23,null,24,26,null,46,26,null,60,20]
[25,24,null,2.5000000000000001E-2,2.5000000000000001E-2,2,null,0.26,23,null,25,27,null,45,27,null,59,21]
[26,23,null,2.5999999999999999E-2,2.6000000000000002E-2,2,null,0.27,24,null,26,27,null,44,27,null,58,22]
[27,23,null,2.7E-2,2.7E-2,2,null,0.28000000000000003,24,null,27,27,null,43,27,null,57,22]
[28,23,null,2.8000000000000001E-2,2.8000000000000001E-2,2,null,0.28999999999999998,25,null,28,27,null,42,27,null,56,23]
[29,23,null,2.9000000000000001E-2,2.9000000000000001E-2,2,null,0.3,25,null,29,27,null,41,27,null,55,23]
[30,23,null,0.03,0.03,3,null,0.31,26,null,30,28,null,40,28,null,54,24]
[31,22,null,3.1E-2,3.1E-2,3,null,0.32,26,null,31,28,null,39,28,null,53,24]
[32,22,null,3.2000000000000001E-2,3.2000000000000001E-2,3,null,0.33,27,null,32,28,null,38,28,null,52,25]
[33,22,null,3.3000000000000002E-2,3.3000000000000002E-2,3,null,0.34,27,null,33,28,null,37,28,null,51,25]
[34,22,null,3.4000000000000002E-2,3.4000000000000002E-2,3,null,0.35,27,null,34,28,null,36,28,null,50,26]
[35,22,null,3.5000000000000003E-2,3.5000000000000003E-2,3,null,0.36,28,null,35,29,null,35,29,null,49,26]
[36,21,null,3.5999999999999997E-2,3.6000000000000004E-2,3,null,0.37,28,null,36,29,null,34,29,null,48,26]
[37,21,null,3.6999999999999998E-2,3.6999999999999998E-2,3,null,0.38,28,null,37,29,null,33,29,null,47,26]
[38,21,null,3.7999999999999999E-2,3.7999999999999999E-2,3,null,0.39,28,null,38,29,null,32,29,null,46,26]
[39,21,null,3.9E-2,3.9E-2,3,null,0.4,29,null,39,29,null,31,29,null,45,27]
[40,21,null,0.04,0.04,4,null,0.41,29,null,40,30,null,30,30,null,44,27]
[41,20,null,4.1000000000000002E-2,4.1000000000000002E-2,4,null,0.42,29,null,41,30,null,29,30,null,43,27]
[42,20,null,4.2000000000000003E-2,4.2000000000000003E-2,4,null,0.43,29,null,42,30,null,28,30,null,42,27]
[43,20,null,4.2999999999999997E-2,4.3000000000000003E-2,4,null,0.44,29,null,43,30,null,27,30,null,41,27]
[44,20,null,4.3999999999999997E-2,4.3999999999999997E-2,4,null,0.45,30,null,44,30,null,26,30,null,40,28]
[45,20,null,4.4999999999999998E-2,4.4999999999999998E-2,4,null,0.46,30,null,45,31,null,25,31,null,39,28]
[46,19,null,4.5999999999999999E-2,4.5999999999999999E-2,4,null,0.47,30,null,46,31,null,24,31,null,38,28]
[47,19,null,4.7E-2,4.7E-2,4,null,0.48,30,null,47,31,null,23,31,null,37,28]
[48,19,null,4.8000000000000001E-2,4.8000000000000001E-2,4,null,0.49,30,null,48,31,null,22,31,null,36,28]
[49,19,null,4.9000000000000002E-2,4.9000000000000002E-2,4,null,0.5,31,null,49,31,null,21,31,null,35,29]
[50,19,null,0.05,0.05,5,null,0.51,31,null,50,32,null,20,32,null,34,29]
[51,18,null,5.0999999999999997E-2,5.1000000000000004E-2,5,null,0.52,31,null,51,32,null,19,32,null,33,29]
[52,18,null,5.1999999999999998E-2,5.2000000000000005E-2,5,null,0.53,31,null,52,32,null,18,32,null,32,29]
[53,17,null,5.2999999999999999E-2,5.2999999999999999E-2,5,null,0.54,31,null,53,32,null,17,32,null,31,29]
[54,17,null,5.3999999999999999E-2,5.3999999999999999E-2,5,null,0.55000000000000004,31,null,54,32,null,16,32,null,30,30]
[55,16,null,5.5E-2,5.5E-2,5,null,0.56000000000000005,31,null,55,33,null,15,33,null,29,30]
[56,16,null,5.6000000000000001E-2,5.6000000000000001E-2,5,null,0.56999999999999995,31,null,56,33,null,14,33,null,28,30]
[57,15,null,5.7000000000000002E-2,5.7000000000000002E-2,5,null,0.57999999999999996,31,null,57,33,null,13,33,null,27,30]
[58,15,null,5.8000000000000003E-2,5.8000000000000003E-2,5,null,0.59,31,null,58,33,null,12,33,null,26,30]
[59,14,null,5.8999999999999997E-2,5.9000000000000004E-2,5,null,0.6,32,null,59,33,null,11,33,null,25,31]
[60,14,null,0.06,0.06,6,null,0.61,32,null,60,34,null,10,34,null,24,31]
[61,13,null,6.0999999999999999E-2,6.0999999999999999E-2,6,null,0.62,32,null,61,34,null,9,34,null,23,31]
[62,13,null,6.2E-2,6.2E-2,6,null,0.63,32,null,62,34,null,8,34,null,22,31]
[63,12,null,6.3E-2,6.3E-2,6,null,0.64,32,null,63,34,null,7,34,null,21,31]
[64,11,null,6.4000000000000001E-2,6.4000000000000001E-2,6,null,0.65,32,null,64,34,null,6,34,null,20,32]
[65,10,null,6.5000000000000002E-2,{"$f":"FLOOR(D67,0.001)","v":6.5000000000000002E-2},6,null,0.66,32,null,65,35,null,5,35,null,19,32]
[66,9,null,6.6000000000000003E-2,6.6000000000000003E-2,6,null,0.67,32,null,66,35,null,4,35,null,18,32]
[67,8,null,6.7000000000000004E-2,6.7000000000000004E-2,6,null,0.68,32,null,67,35,null,3,35,null,17,32]
[68,7,null,6.8000000000000005E-2,6.8000000000000005E-2,6,null,0.69,32,null,68,35,null,2,35,null,16,32]
[69,6,null,6.8999999999999895E-2,6.8000000000000005E-2,6,null,0.7,33,null,69,35,null,1,35,null,15,33]
[70,5,null,6.9999999999999896E-2,6.9000000000000006E-2,7,null,0.71,33,null,70,36,null,0,36,null,14,33]
[null,null,null,7.0999999999999994E-2,7.1000000000000008E-2,7,null,0.72,33,null,71,36,null,-1,36,null,13,33]
[null,null,null,7.1999999999999897E-2,7.1000000000000008E-2,7,null,0.73,33,null,72,36,null,-2,36,null,12,33]
[null,null,null,7.2999999999999898E-2,7.2000000000000008E-2,7,null,0.74,33,null,73,36,null,-3,36,null,11,33]
[null,null,null,7.3999999999999899E-2,7.2999999999999995E-2,7,null,0.75,33,null,74,36,null,-4,36,null,10,34]
[null,null,null,7.49999999999999E-2,7.3999999999999996E-2,7,null,0.76,33,null,75,36,null,-5,36,null,9,34]
[null,null,null,7.5999999999999901E-2,7.4999999999999997E-2,7,null,0.77,33,null,76,36,null,-6,36,null,8,34]
[null,null,null,7.6999999999999902E-2,7.5999999999999998E-2,7,null,0.78,33,null,77,36,null,-7,36,null,7,34]
[null,null,null,7.7999999999999903E-2,7.6999999999999999E-2,7,null,0.79,33,null,78,36,null,-8,36,null,6,34]
[null,null,null,7.8999999999999904E-2,7.8E-2,7,null,0.8,34,null,79,36,null,-9,36,null,5,35]
[null,null,null,7.9999999999999905E-2,7.9000000000000001E-2,8,null,0.81,34,null,80,36,null,-10,36,null,4,35]
[null,null,null,8.0999999999999905E-2,0.08,8,null,0.82,34,null,81,36,null,-11,36,null,3,35]
[null,null,null,8.1999999999999906E-2,8.1000000000000003E-2,8,null,0.83,34,null,82,36,null,-12,36,null,2,35]
[null,null,null,8.2999999999999893E-2,8.2000000000000003E-2,8,null,0.84,34,null,83,36,null,-13,36,null,1,35]
[null,null,null,8.3999999999999894E-2,8.3000000000000004E-2,8,null,0.85,34,null,84,36,null,-14,36,null,0,36]
[null,null,null,8.4999999999999895E-2,8.4000000000000005E-2,8,null,0.86,34,null,85,36,null,-15,36,null,-1,36]
[null,null,null,8.5999999999999896E-2,8.5000000000000006E-2,8,null,0.87,34,null,86,36,null,-16,36,null,-2,36]
[null,null,null,8.6999999999999897E-2,8.6000000000000007E-2,8,null,0.88,34,null,87,36,null,-17,36,null,-3,36]
[null,null,null,8.7999999999999898E-2,8.7000000000000008E-2,8,null,0.89,34,null,88,36,null,-18,36,null,-4,36]
[null,null,null,8.8999999999999899E-2,8.7999999999999995E-2,8,null,0.9,35,null,89,36,null,-19,36,null,-5,36]
[null,null,null,8.99999999999999E-2,8.8999999999999996E-2,9,null,0.91,35,null,90,36,null,-20,36,null,-6,36]
[null,null,null,9.09999999999999E-2,0.09,9,null,0.92,35,null,91,36,null,-21,36,null,-7,36]
[null,null,null,9.1999999999999901E-2,9.0999999999999998E-2,9,null,0.93,35,null,92,36,null,-22,36,null,-8,36]
[null,null,null,9.2999999999999902E-2,9.1999999999999998E-2,9,null,0.94,35,null,93,36,null,-23,36,null,-9,36]
[null,null,null,9.3999999999999903E-2,9.2999999999999999E-2,9,null,0.95,35,null,94,36,null,-24,36,null,-10,36]
[null,null,null,9.4999999999999904E-2,9.4E-2,9,null,0.96,35,null,95,36,null,-25,36,null,-11,36]
[null,null,null,9.5999999999999905E-2,9.5000000000000001E-2,9,null,0.97,35,null,96,36,null,-26,36,null,-12,36]
[null,null,null,9.6999999999999906E-2,9.6000000000000002E-2,9,null,0.98,35,null,97,36,null,-27,36,null,-13,36]
[null,null,null,9.7999999999999907E-2,9.7000000000000003E-2,9,null,0.99,35,null,98,36,null,-28,36,null,-14,36]
[null,null,null,9.8999999999999894E-2,9.8000000000000004E-2,9,null,1,36,null,99,36,null,-29,36,null,-15,36]
[null,null,null,9.9999999999999895E-2,9.9000000000000005E-2,10,null,1.01,36,null,100,36,null,-30,36,null,-16,36]
[null,null,null,0.10100000000000001,0.10100000000000001,10,null,1.02,36,null,101,36,null,-31,36,null,-17,36]
[null,null,null,0.10199999999999999,0.10200000000000001,10,null,1.03,36,null,102,36,null,-32,36,null,-18,36]
[null,null,null,0.10299999999999999,0.10300000000000001,10,null,1.04,36,null,103,36,null,-33,36,null,-19,36]
[null,null,null,0.104,0.10400000000000001,10,null,1.05,36,null,104,36,null,-34,36,null,-20,36]
[null,null,null,0.105,0.105,10,null,1.06,36,null,105,36,null,-35,36,null,-21,36]
[null,null,null,0.106,0.106,10,null,1.07,36,null,106,36,null,-36,36,null,-22,36]
[null,null,null,0.107,0.107,10,null,1.08,36,null,107,36,null,-37,36,null,-23,36]
[null,null,null,0.108,0.108,10,null,1.0900000000000001,36,null,108,36,null,-38,36,null,-24,36]
[null,null,null,0.109,0.109,10,null,1.1000000000000001,36,null,109,36,null,-39,36,null,-25,36]
[null,null,null,0.11,0.11,10,null,1.1100000000000001,36,null,110,36,null,-40,36,null,-26,36]
[null,null,null,0.111,0.111,10,null,1.1200000000000001,36,null,111,36,null,-41,36,null,-27,36]
[null,null,null,0.112,0.112,10,null,1.1299999999999999,36,null,112,36,null,-42,36,null,-28,36]
[null,null,null,0.113,0.113,10,null,1.1399999999999999,36,null,113,36,null,-43,36,null,-29,36]
[null,null,null,0.114,0.114,10,null,1.1499999999999999,36,null,114,36,null,-44,36,null,-30,36]
[null,null,null,0.115,0.115,10,null,1.1599999999999999,36,null,115,36,null,-45,36,null,-31,36]
[null,null,null,0.11600000000000001,0.11600000000000001,10,null,1.17,36,null,116,36,null,-46,36,null,-32,36]
[null,null,null,0.11700000000000001,0.11700000000000001,10,null,1.18,36,null,117,36,null,-47,36,null,-33,36]
[null,null,null,0.11799999999999999,0.11800000000000001,10,null,1.19,36,null,118,36,null,-48,36,null,-34,36]
[null,null,null,0.11899999999999999,0.11900000000000001,10,null,1.2,36,null,119,36,null,-49,36,null,-35,36]
[null,null,null,0.12,0.12,11,null,1.21,36,null,120,36,null,-50,36,null,-36,36]
[null,null,null,0.121,0.121,11,null,1.22,36,null,121,36,null,-51,36,null,-37,36]
[null,null,null,0.122,0.122,11,null,1.23,36,null,122,36,null,-52,36,null,-38,36]
[null,null,null,0.123,0.123,11,null,1.24,36,null,123,36,null,-53,36,null,-39,36]
[null,null,null,0.124,0.124,11,null,1.25,36,null,124,36,null,-54,36,null,-40,36]
[null,null,null,0.125,0.125,11,null,1.26,36,null,125,36,null,-55,36,null,-41,36]
[null,null,null,0.126,0.126,11,null,1.27,36,null,126,36,null,-56,36,null,-42,36]
[null,null,null,0.127,0.127,11,null,1.28,36,null,127,36,null,-57,36,null,-43,36]
[null,null,null,0.128,0.128,11,null,1.29,36,null,128,36,null,-58,36,null,-44,36]
[null,null,null,0.129,{"$f":"FLOOR(D131,0.001)","v":0.129},11,null,1.3,36,null,129,36,null,-59,36,null,-45,36]
[null,null,null,0.13,0.13,11,null,1.31,36,null,130,36,null,-60,36,null,-46,36]
[null,null,null,0.13100000000000001,0.13100000000000001,11,null,1.32,36,null,131,36,null,-61,36,null,-47,36]
[null,null,null,0.13200000000000001,0.13200000000000001,11,null,1.33,36,null,132,36,null,-62,36,null,-48,36]
[null,null,null,0.13300000000000001,0.13300000000000001,11,null,1.34,36,null,133,36,null,-63,36,null,-49,36]
[null,null,null,0.13400000000000001,0.13400000000000001,11,null,1.35,36,null,134,36,null,-64,36,null,-50,36]
[null,null,null,0.13500000000000001,0.13500000000000001,11,null,1.36,36,null,135,36,null,-65,36,null,-51,36]
[null,null,null,0.13600000000000001,0.13600000000000001,11,null,1.37,36,null,136,36,null,-66,36,null,-52,36]
[null,null,null,0.13700000000000001,0.13700000000000001,11,null,1.38,36,null,137,36,null,-67,36,null,-53,36]
[null,null,null,0.13800000000000001,0.13800000000000001,11,null,1.39,36,null,138,36,null,-68,36,null,-54,36]
[null,null,null,0.13900000000000001,0.13900000000000001,11,null,1.4,36,null,139,36,null,-69,36,null,-55,36]
[null,null,null,0.14000000000000001,0.14000000000000001,12,null,1.41,36,null,140,36,null,-70,36,null,-56,36]
[null,null,null,0.14099999999999999,0.14100000000000001,12,null,1.42,36,null,141,36,null,-71,36,null,-57,36]
[null,null,null,0.14199999999999999,0.14200000000000002,12,null,1.43,36,null,142,36,null,-72,36,null,-58,36]
[null,null,null,0.14299999999999999,0.14300000000000002,12,null,1.44,36,null,143,36,null,-73,36,null,-59,36]
[null,null,null,0.14399999999999999,0.14400000000000002,12,null,1.45,36,null,144,36,null,-74,36,null,-60,36]
[null,null,null,0.14499999999999999,0.14499999999999999,12,null,1.46,36,null,145,36,null,-75,36,null,-61,36]
[null,null,null,0.14599999999999999,0.14599999999999999,12,null,1.47,36,null,146,36,null,-76,36,null,-62,36]
[null,null,null,0.14699999999999999,0.14699999999999999,12,null,1.48,36,null,147,36,null,-77,36,null,-63,36]
[null,null,null,0.14799999999999999,0.14799999999999999,12,null,1.49,36,null,148,36,null,-78,36,null,-64,36]
[null,null,null,0.14899999999999999,0.14899999999999999,12,null,1.5,36,null,149,36,null,-79,36,null,-65,36]
[null,null,null,0.15,0.15,12,null,1.51,36,null,150,36,null,-80,36,null,-66,36]
[null,null,null,0.151,0.151,12,null,1.52,36,null,151,36,null,-81,36,null,-67,36]
[null,null,null,0.152,0.152,12,null,1.53,36,null,152,36,null,-82,36,null,-68,36]
[null,null,null,0.153,0.153,12,null,1.54,36,null,153,36,null,-83,36,null,-69,36]
[null,null,null,0.154,0.154,12,null,1.55,36,null,154,36,null,-84,36,null,-70,36]
[null,null,null,0.155,0.155,12,null,1.56,36,null,155,36,null,-85,36,null,-71,36]
[null,null,null,0.156,0.156,12,null,1.57,36,null,156,36,null,-86,36,null,-72,36]
[null,null,null,0.157,0.157,12,null,1.58,36,null,157,36,null,-87,36,null,-73,36]
[null,null,null,0.158,0.158,12,null,1.59,36,null,158,36,null,-88,36,null,-74,36]
[null,null,null,0.159,0.159,12,null,1.6,36,null,159,36,null,-89,36,null,-75,36]
[null,null,null,0.16,0.16,13,null,1.61,36,null,160,36,null,-90,36,null,-76,36]
[null,null,null,0.161,0.161,13,null,1.62,36,null,161,36,null,-91,36,null,-77,36]
[null,null,null,0.16200000000000001,0.16200000000000001,13,null,1.63,36,null,162,36,null,-92,36,null,-78,36]
[null,null,null,0.16300000000000001,0.16300000000000001,13,null,1.64,36,null,163,36,null,-93,36,null,-79,36]
[null,null,null,0.16400000000000001,0.16400000000000001,13,null,1.65,36,null,164,36,null,-94,36,null,-80,36]
[null,null,null,0.16500000000000001,0.16500000000000001,13,null,1.66,36,null,165,36,null,-95,36,null,-81,36]
[null,null,null,0.16600000000000001,0.16600000000000001,13,null,1.67,36,null,166,36,null,-96,36,null,-82,36]
[null,null,null,0.16700000000000001,0.16700000000000001,13,null,1.68,36,null,167,36,null,-97,36,null,-83,36]
[null,null,null,0.16800000000000001,0.16800000000000001,13,null,1.69,36,null,168,36,null,-98,36,null,-84,36]
[null,null,null,0.16900000000000001,0.16900000000000001,13,null,1.7,36,null,169,36,null,-99,36,null,-85,36]
[null,null,null,0.17,0.17,13,null,1.71,36,null,170,36,null,-100,36,null,-86,36]
[null,null,null,0.17100000000000001,0.17100000000000001,13,null,1.72,36,null,171,36,null,-101,36,null,-87,36]
[null,null,null,0.17199999999999999,0.17200000000000001,13,null,1.73,36,null,172,36,null,-102,36,null,-88,36]
[null,null,null,0.17299999999999999,0.17300000000000001,13,null,1.74,36,null,173,36,null,-103,36,null,-89,36]
[null,null,null,0.17399999999999999,0.17400000000000002,13,null,1.75,36,null,174,36,null,-104,36,null,-90,36]
[null,null,null,0.17499999999999999,0.17500000000000002,13,null,1.76,36,null,175,36,null,-105,36,null,-91,36]
[null,null,null,0.17599999999999999,0.17599999999999999,13,null,1.77,36,null,176,36,null,-106,36,null,-92,36]
[null,null,null,0.17699999999999999,0.17699999999999999,13,null,1.78,36,null,177,36,null,-107,36,null,-93,36]
[null,null,null,0.17799999999999999,0.17799999999999999,13,null,1.79,36,null,178,36,null,-108,36,null,-94,36]
[null,null,null,0.17899999999999999,0.17899999999999999,13,null,1.8,36,null,179,36,null,-109,36,null,-95,36]
[null,null,null,0.18,0.18,14,null,1.81,36,null,180,36,null,-110,36,null,-96,36]
[null,null,null,0.18099999999999999,0.18099999999999999,14,null,1.82,36,null,181,36,null,-111,36,null,-97,36]
[null,null,null,0.182,0.182,14,null,1.83,36,null,182,36,null,-112,36,null,-98,36]
[null,null,null,0.183,0.183,14,null,1.84,36,null,183,36,null,-113,36,null,-99,36]
[null,null,null,0.184,0.184,14,null,1.85,36,null,184,36,null,-114,36,null,-100,36]
[null,null,null,0.185,0.185,14,null,1.86,36,null,185,36,null,-115,36,null,-101,36]
[null,null,null,0.186,0.186,14,null,1.87,36,null,186,36,null,-116,36,null,-102,36]
[null,null,null,0.187,0.187,14,null,1.88,36,null,187,36,null,-117,36,null,-103,36]
[null,null,null,0.188,0.188,14,null,1.89,36,null,188,36,null,-118,36,null,-104,36]
[null,null,null,0.189,0.189,14,null,1.9,36,null,189,36,null,-119,36,null,-105,36]
[null,null,null,0.19,0.19,14,null,1.91,36,null,190,36,null,-120,36,null,-106,36]
[null,null,null,0.191,0.191,14,null,1.92,36,null,191,36,null,-121,36,null,-107,36]
[null,null,null,0.192,0.192,14,null,1.93,36,null,192,36,null,-122,36,null,-108,36]
[null,null,null,0.193,{"$f":"FLOOR(D195,0.001)","v":0.193},14,null,1.94,36,null,193,36,null,-123,36,null,-109,36]
[null,null,null,0.19400000000000001,0.19400000000000001,14,null,1.95,36,null,194,36,null,-124,36,null,-110,36]
[null,null,null,0.19500000000000001,0.19500000000000001,14,null,1.96,36,null,195,36,null,-125,36,null,-111,36]
[null,null,null,0.19600000000000001,0.19600000000000001,14,null,1.97,36,null,196,36,null,-126,36,null,-112,36]
[null,null,null,0.19700000000000001,0.19700000000000001,14,null,1.98,36,null,197,36,null,-127,36,null,-113,36]
[null,null,null,0.19800000000000001,0.19800000000000001,14,null,1.99,36,null,198,36,null,-128,36,null,-114,36]
[null,null,null,0.19900000000000001,0.19900000000000001,14,null,2,36,null,199,36,null,-129,36,null,-115,36]
[null,null,null,0.2,0.2,15,null,2.0099999999999998,36,null,200,36,null,-130,36,null,-116,36]
[null,null,null,0.20100000000000001,0.20100000000000001,15,null,2.02,36,null,201,36,null,-131,36,null,-117,36]
[null,null,null,0.20200000000000001,0.20200000000000001,15,null,2.0299999999999998,36,null,202,36,null,-132,36,null,-118,36]
[null,null,null,0.20300000000000001,0.20300000000000001,15,null,2.04,36,null,203,36,null,-133,36,null,-119,36]
[null,null,null,0.20399999999999999,0.20400000000000001,15,null,2.0499999999999998,36,null,204,36,null,-134,36,null,-120,36]
[null,null,null,0.20499999999999999,0.20500000000000002,15,null,2.06,36,null,205,36,null,-135,36,null,-121,36]
[null,null,null,0.20599999999999999,0.20600000000000002,15,null,2.0699999999999998,36,null,206,36,null,-136,36,null,-122,36]
[null,null,null,0.20699999999999999,0.20700000000000002,15,null,2.08,36,null,207,36,null,-137,36,null,-123,36]
[null,null,null,0.20799999999999999,0.20800000000000002,15,null,2.09,36,null,208,36,null,-138,36,null,-124,36]
[null,null,null,0.20899999999999999,0.20899999999999999,15,null,2.1,36,null,209,36,null,-139,36,null,-125,36]
[null,null,null,0.21,0.21,15,null,2.11,36,null,210,36,null,-140,36,null,-126,36]
[null,null,null,0.21099999999999999,0.21099999999999999,15,null,2.12,36,null,211,36,null,-141,36,null,-127,36]
[null,null,null,0.21199999999999999,0.21199999999999999,15,null,2.13,36,null,212,36,null,-142,36,null,-128,36]
[null,null,null,0.21299999999999999,0.21299999999999999,15,null,2.14,36,null,213,36,null,-143,36,null,-129,36]
[null,null,null,0.214,0.214,15,null,2.15,36,null,214,36,null,-144,36,null,-130,36]
[null,null,null,0.215,0.215,15,null,2.16,36,null,215,36,null,-145,36,null,-131,36]
[null,null,null,0.216,0.216,15,null,2.17,36,null,216,36,null,-146,36,null,-132,36]
[null,null,null,0.217,0.217,15,null,2.1800000000000002,36,null,217,36,null,-147,36,null,-133,36]
[null,null,null,0.218,0.218,15,null,2.19,36,null,218,36,null,-148,36,null,-134,36]
[null,null,null,0.219,0.219,15,null,2.2000000000000002,36,null,219,36,null,-149,36,null,-135,36]
[null,null,null,0.22,0.22,16,null,2.21,36,null,220,36,null,-150,36,null,-136,36]
[null,null,null,0.221,0.221,16,null,2.2200000000000002,36,null,221,36,null,-151,36,null,-137,36]
[null,null,null,0.222,0.222,16,null,2.23,36,null,222,36,null,-152,36,null,-138,36]
[null,null,null,0.223,0.223,16,null,2.2400000000000002,36,null,223,36,null,-153,36,null,-139,36]
[null,null,null,0.224,0.224,16,null,2.25,36,null,224,36,null,-154,36,null,-140,36]
[null,null,null,0.22500000000000001,0.22500000000000001,16,null,2.2599999999999998,36,null,225,36,null,-155,36,null,-141,36]
[null,null,null,0.22600000000000001,0.22600000000000001,16,null,2.27,36,null,226,36,null,-156,36,null,-142,36]
[null,null,null,0.22700000000000001,0.22700000000000001,16,null,2.2799999999999998,36,null,227,36,null,-157,36,null,-143,36]
[null,null,null,0.22800000000000001,0.22800000000000001,16,null,2.29,36,null,228,36,null,-158,36,null,-144,36]
[null,null,null,0.22900000000000001,0.22900000000000001,16,null,2.2999999999999998,36,null,229,36,null,-159,36,null,-145,36]
[null,null,null,0.23,0.23,16,null,2.31,36,null,230,36,null,-160,36,null,-146,36]
[null,null,null,0.23100000000000001,0.23100000000000001,16,null,2.3199999999999998,36,null,231,36,null,-161,36,null,-147,36]
[null,null,null,0.23200000000000001,0.23200000000000001,16,null,2.33,36,null,232,36,null,-162,36,null,-148,36]
[null,null,null,0.23300000000000001,0.23300000000000001,16,null,2.34,36,null,233,36,null,-163,36,null,-149,36]
[null,null,null,0.23400000000000001,0.23400000000000001,16,null,2.35,36,null,234,36,null,-164,36,null,-150,36]
[null,null,null,0.23499999999999999,0.23500000000000001,16,null,2.36,36,null,235,36,null,-165,36,null,-151,36]
[null,null,null,0.23599999999999999,0.23600000000000002,16,null,2.37,36,null,236,36,null,-166,36,null,-152,36]
[null,null,null,0.23699999999999999,0.23700000000000002,16,null,2.38,36,null,237,36,null,-167,36,null,-153,36]
[null,null,null,0.23799999999999999,0.23800000000000002,16,null,2.39,36,null,238,36,null,-168,36,null,-154,36]
[null,null,null,0.23899999999999999,0.23900000000000002,16,null,2.4,36,null,239,36,null,-169,36,null,-155,36]
[null,null,null,0.24,0.24,17,null,2.41,36,null,240,36,null,-170,36,null,-156,36]
[null,null,null,0.24099999999999999,0.24099999999999999,17,null,2.42,36,null,241,36,null,-171,36,null,-157,36]
[null,null,null,0.24199999999999999,0.24199999999999999,17,null,2.4300000000000002,36,null,242,36,null,-172,36,null,-158,36]
[null,null,null,0.24299999999999999,0.24299999999999999,17,null,2.44,36,null,243,36,null,-173,36,null,-159,36]
[null,null,null,0.24399999999999999,0.24399999999999999,17,null,2.4500000000000002,36,null,244,36,null,-174,36,null,-160,36]
[null,null,null,0.245,0.245,17,null,2.46,36,null,245,36,null,-175,36,null,-161,36]
[null,null,null,0.246,0.246,17,null,2.4700000000000002,36,null,246,36,null,-176,36,null,-162,36]
[null,null,null,0.247,0.247,17,null,2.48,36,null,247,36,null,-177,36,null,-163,36]
[null,null,null,0.248,0.248,17,null,2.4900000000000002,36,null,248,36,null,-178,36,null,-164,36]
[null,null,null,0.249,0.249,17,null,2.5,36,null,249,36,null,-179,36,null,-165,36]
[null,null,null,0.25,0.25,17,null,2.5099999999999998,36,null,250,36,null,-180,36,null,-166,36]
[null,null,null,0.251,0.251,17,null,2.52,36,null,251,36,null,-181,36,null,-167,36]
[null,null,null,0.252,0.252,17,null,2.5299999999999998,36,null,252,36,null,-182,36,null,-168,36]
[null,null,null,0.253,0.253,17,null,2.54,36,null,253,36,null,-183,36,null,-169,36]
[null,null,null,0.254,0.254,17,null,2.5499999999999998,36,null,254,36,null,-184,36,null,-170,36]
[null,null,null,0.255,0.255,17,null,2.56,36,null,255,36,null,-185,36,null,-171,36]
[null,null,null,0.25600000000000001,0.25600000000000001,17,null,2.57,36,null,256,36,null,-186,36,null,-172,36]
[null,null,null,0.25700000000000001,{"$f":"FLOOR(D259,0.001)","v":0.25700000000000001},17,null,2.58,36,null,257,36,null,-187,36,null,-173,36]
[null,null,null,0.25800000000000001,0.25800000000000001,17,null,2.59,36,null,258,36,null,-188,36,null,-174,36]
[null,null,null,0.25900000000000001,0.25900000000000001,17,null,2.6,36,null,259,36,null,-189,36,null,-175,36]
[null,null,null,0.26,0.26,18,null,2.61,36,null,260,36,null,-190,36,null,-176,36]
[null,null,null,0.26100000000000001,0.26100000000000001,18,null,2.62,36,null,261,36,null,-191,36,null,-177,36]
[null,null,null,0.26200000000000001,0.26200000000000001,18,null,2.63,36,null,262,36,null,-192,36,null,-178,36]
[null,null,null,0.26300000000000001,0.26300000000000001,18,null,2.64,36,null,263,36,null,-193,36,null,-179,36]
[null,null,null,0.26400000000000001,0.26400000000000001,18,null,2.65,36,null,264,36,null,-194,36,null,-180,36]
[null,null,null,0.26500000000000001,0.26500000000000001,18,null,2.66,36,null,265,36,null,-195,36,null,-181,36]
[null,null,null,0.26600000000000001,0.26600000000000001,18,null,2.67,36,null,266,36,null,-196,36,null,-182,36]
[null,null,null,0.26700000000000002,0.26700000000000002,18,null,2.68,36,null,267,36,null,-197,36,null,-183,36]
[null,null,null,0.26800000000000002,0.26800000000000002,18,null,2.69,36,null,268,36,null,-198,36,null,-184,36]
[null,null,null,0.26900000000000002,0.26900000000000002,18,null,2.7,36,null,269,36,null,-199,36,null,-185,36]
[null,null,null,0.27,0.27,18,null,2.71,36,null,270,36,null,-200,36,null,-186,36]
[null,null,null,0.27100000000000002,0.27100000000000002,18,null,2.72,36,null,271,36,null,-201,36,null,-187,36]
[null,null,null,0.27200000000000002,0.27200000000000002,18,null,2.73,36,null,272,36,null,-202,36,null,-188,36]
[null,null,null,0.27300000000000002,0.27300000000000002,18,null,2.74,36,null,273,36,null,-203,36,null,-189,36]
[null,null,null,0.27400000000000002,0.27400000000000002,18,null,2.75,36,null,274,36,null,-204,36,null,-190,36]
[null,null,null,0.27500000000000002,0.27500000000000002,18,null,2.76,36,null,275,36,null,-205,36,null,-191,36]
[null,null,null,0.27600000000000002,0.27600000000000002,18,null,2.77,36,null,276,36,null,-206,36,null,-192,36]
[null,null,null,0.27700000000000002,0.27700000000000002,18,null,2.78,36,null,277,36,null,-207,36,null,-193,36]
[null,null,null,0.27800000000000002,0.27800000000000002,18,null,2.79,36,null,278,36,null,-208,36,null,-194,36]
[null,null,null,0.27900000000000003,0.27900000000000003,18,null,2.8,36,null,279,36,null,-209,36,null,-195,36]
[null,null,null,0.28000000000000003,0.28000000000000003,19,null,2.81,36,null,280,36,null,-210,36,null,-196,36]
[null,null,null,0.28100000000000003,0.28100000000000003,19,null,2.82,36,null,281,36,null,-211,36,null,-197,36]
[null,null,null,0.28199999999999997,0.28200000000000003,19,null,2.83,36,null,282,36,null,-212,36,null,-198,36]
[null,null,null,0.28299999999999997,0.28300000000000003,19,null,2.84,36,null,283,36,null,-213,36,null,-199,36]
[null,null,null,0.28399999999999997,0.28400000000000003,19,null,2.85,36,null,284,36,null,-214,36,null,-200,36]
[null,null,null,0.28499999999999998,0.28500000000000003,19,null,2.86,36,null,285,36,null,-215,36,null,-201,36]
[null,null,null,0.28599999999999998,0.28600000000000003,19,null,2.87,36,null,286,36,null,-216,36,null,-202,36]
[null,null,null,0.28699999999999998,0.28700000000000003,19,null,2.88,36,null,287,36,null,-217,36,null,-203,36]
[null,null,null,0.28799999999999998,0.28800000000000003,19,null,2.89,36,null,288,36,null,-218,36,null,-204,36]
[null,null,null,0.28899999999999998,0.28899999999999998,19,null,2.9,36,null,289,36,null,-219,36,null,-205,36]
[null,null,null,0.28999999999999998,0.28999999999999998,19,null,2.91,36,null,290,36,null,-220,36,null,-206,36]
[null,null,null,0.29099999999999998,0.29099999999999998,19,null,2.92,36,null,291,36,null,-221,36,null,-207,36]
[null,null,null,0.29199999999999998,0.29199999999999998,19,null,2.93,36,null,292,36,null,-222,36,null,-208,36]
[null,null,null,0.29299999999999998,0.29299999999999998,19,null,2.94,36,null,293,36,null,-223,36,null,-209,36]
[null,null,null,0.29399999999999998,0.29399999999999998,19,null,2.95,36,null,294,36,null,-224,36,null,-210,36]
[null,null,null,0.29499999999999998,0.29499999999999998,19,null,2.96,36,null,295,36,null,-225,36]
[null,null,null,0.29599999999999999,0.29599999999999999,19,null,2.97,36,null,296,36,null,-226,36]
[null,null,null,0.29699999999999999,0.29699999999999999,19,null,2.98,36,null,297,36,null,-227,36]
[null,null,null,0.29799999999999999,0.29799999999999999,19,null,2.99,36,null,298,36,null,-228,36]
[null,null,null,0.29899999999999999,0.29899999999999999,19,null,3,36,null,299,36,null,-229,36]
[null,null,null,0.3,0.3,20,null,3.01,36,null,300,36,null,-230,36]
[null,null,null,0.30099999999999999,0.30099999999999999,20,null,3.02,36,null,301,36,null,-231,36]
[null,null,null,0.30199999999999999,0.30199999999999999,20,null,3.03,36,null,302,36,null,-232,36]
[null,null,null,0.30299999999999999,0.30299999999999999,20,null,3.04,36,null,303,36,null,-233,36]
[null,null,null,0.30399999999999999,0.30399999999999999,20,null,3.05,36,null,304,36,null,-234,36]
[null,null,null,0.30499999999999999,0.30499999999999999,20,null,3.06,36,null,305,36,null,-235,36]
[null,null,null,0.30599999999999999,0.30599999999999999,20,null,3.07,36,null,306,36,null,-236,36]
[null,null,null,0.307,0.307,20,null,3.08,36,null,307,36,null,-237,36]
[null,null,null,0.308,0.308,20,null,3.09,36,null,308,36,null,-238,36]
[null,null,null,0.309,0.309,20,null,3.1,36,null,309,36,null,-239,36]
[null,null,null,0.31,0.31,20,null,3.11,36,null,310,36,null,-240,36]
[null,null,null,0.311,0.311,20,null,3.12,36,null,311,36,null,-241,36]
[null,null,null,0.312,0.312,20,null,3.13,36,null,312,36,null,-242,36]
[null,null,null,0.313,0.313,20,null,3.14,36,null,313,36,null,-243,36]
[null,null,null,0.314,0.314,20,null,3.15,36,null,314,36,null,-244,36]
[null,null,null,0.315,0.315,20,null,3.16,36,null,315,36,null,-245,36]
[null,null,null,0.316,0.316,20,null,3.17,36,null,316,36,null,-246,36]
[null,null,null,0.317,0.317,20,null,3.18,36,null,317,36,null,-247,36]
[null,null,null,0.318,0.318,20,null,3.19,36,null,318,36,null,-248,36]
[null,null,null,0.31900000000000001,0.31900000000000001,20,null,3.2,36,null,319,36,null,-249,36]
[null,null,null,0.32,0.32,21,null,3.21,36,null,320,36,null,-250,36]
[null,null,null,0.32100000000000001,{"$f":"FLOOR(D323,0.001)","v":0.32100000000000001},21,null,3.22,36,null,321,36,null,-251,36]
[null,null,null,0.32200000000000001,0.32200000000000001,21,null,3.23,36,null,322,36,null,-252,36]
[null,null,null,0.32300000000000001,0.32300000000000001,21,null,3.24,36,null,323,36,null,-253,36]
[null,null,null,0.32400000000000001,0.32400000000000001,21,null,3.25,36,null,324,36,null,-254,36]
[null,null,null,0.32500000000000001,0.32500000000000001,21,null,3.26,36,null,325,36,null,-255,36]
[null,null,null,0.32600000000000001,0.32600000000000001,21,null,3.27,36,null,326,36,null,-256,36]
[null,null,null,0.32700000000000001,0.32700000000000001,21,null,3.28,36,null,327,36,null,-257,36]
[null,null,null,0.32800000000000001,0.32800000000000001,21,null,3.29,36,null,328,36,null,-258,36]
[null,null,null,0.32900000000000001,0.32900000000000001,21,null,3.3,36,null,329,36,null,-259,36]
[null,null,null,0.33,0.33,21,null,3.31,36,null,330,36,null,-260,36]
[null,null,null,0.33100000000000002,0.33100000000000002,21,null,3.32,36,null,331,36,null,-261,36]
[null,null,null,0.33200000000000002,0.33200000000000002,21,null,3.33,36,null,332,36,null,-262,36]
[null,null,null,0.33300000000000002,0.33300000000000002,21,null,3.34,36,null,333,36,null,-263,36]
[null,null,null,0.33400000000000002,0.33400000000000002,21,null,3.35,36,null,334,36,null,-264,36]
[null,null,null,0.33500000000000002,0.33500000000000002,21,null,3.36,36,null,335,36,null,-265,36]
[null,null,null,0.33600000000000002,0.33600000000000002,21,null,3.37,36,null,336,36,null,-266,36]
[null,null,null,0.33700000000000002,0.33700000000000002,21,null,3.38,36,null,337,36,null,-267,36]
[null,null,null,0.33800000000000002,0.33800000000000002,21,null,3.39,36,null,338,36,null,-268,36]
[null,null,null,0.33900000000000002,0.33900000000000002,21,null,3.4,36,null,339,36,null,-269,36]
[null,null,null,0.34,0.34,22,null,3.41,36,null,340,36,null,-270,36]
[null,null,null,0.34100000000000003,0.34100000000000003,22,null,3.42,36,null,341,36,null,-271,36]
[null,null,null,0.34200000000000003,0.34200000000000003,22,null,3.43,36,null,342,36,null,-272,36]
[null,null,null,0.34300000000000003,0.34300000000000003,22,null,3.44,36,null,343,36,null,-273,36]
[null,null,null,0.34399999999999997,0.34400000000000003,22,null,3.45,36,null,344,36,null,-274,36]
[null,null,null,0.34499999999999997,0.34500000000000003,22,null,3.46,36,null,345,36,null,-275,36]
[null,null,null,0.34599999999999997,0.34600000000000003,22,null,3.47,36,null,346,36,null,-276,36]
[null,null,null,0.34699999999999998,0.34700000000000003,22,null,3.48,36,null,347,36,null,-277,36]
[null,null,null,0.34799999999999998,0.34800000000000003,22,null,3.49,36,null,348,36,null,-278,36]
[null,null,null,0.34899999999999998,0.34900000000000003,22,null,3.5,36,null,349,36,null,-279,36]
[null,null,null,0.35,0.35000000000000003,22,null,3.51,36,null,350,36,null,-280,36]
[null,null,null,0.35099999999999998,0.35100000000000003,22,null,3.52,36,null,351,36,null,-281,36]
[null,null,null,0.35199999999999998,0.35199999999999998,22,null,3.53,36,null,352,36,null,-282,36]
[null,null,null,0.35299999999999998,0.35299999999999998,22,null,3.54,36,null,353,36,null,-283,36]
[null,null,null,0.35399999999999998,0.35399999999999998,22,null,3.55,36,null,354,36,null,-284,36]
[null,null,null,0.35499999999999998,0.35499999999999998,22,null,3.56,36,null,355,36,null,-285,36]
[null,null,null,0.35599999999999998,0.35599999999999998,22,null,3.57,36,null,356,36,null,-286,36]
[null,null,null,0.35699999999999998,0.35699999999999998,22,null,3.58,36,null,357,36,null,-287,36]
[null,null,null,0.35799999999999998,0.35799999999999998,22,null,3.59,36,null,358,36,null,-288,36]
[null,null,null,0.35899999999999999,0.35899999999999999,22,null,3.6,36,null,359,36,null,-289,36]
[null,null,null,0.36,0.36,22,null,3.61,36,null,360,36,null,-290,36]
[null,null,null,0.36099999999999999,0.36099999999999999,22,null,3.62,36,null,361,36,null,-291,36]
[null,null,null,0.36199999999999999,0.36199999999999999,22,null,3.63,36,null,362,36,null,-292,36]
[null,null,null,0.36299999999999999,0.36299999999999999,22,null,3.64,36,null,363,36,null,-293,36]
[null,null,null,0.36399999999999999,0.36399999999999999,22,null,3.65,36,null,364,36,null,-294,36]
[null,null,null,0.36499999999999999,0.36499999999999999,22,null,3.66,36,null,365,36,null,-295,36]
[null,null,null,0.36599999999999999,0.36599999999999999,22,null,3.67,36,null,366,36,null,-296,36]
[null,null,null,0.36699999999999999,0.36699999999999999,22,null,3.68,36,null,367,36,null,-297,36]
[null,null,null,0.36799999999999999,0.36799999999999999,22,null,3.69,36,null,368,36,null,-298,36]
[null,null,null,0.36899999999999999,0.36899999999999999,22,null,3.7,36,null,369,36,null,-299,36]
[null,null,null,0.37,0.37,23,null,3.71,36,null,370,36,null,-300,36]
[null,null,null,0.371,0.371,23,null,3.72,36,null,371,36,null,-301,36]
[null,null,null,0.372,0.372,23,null,3.73,36,null,372,36,null,-302,36]
[null,null,null,0.373,0.373,23,null,3.74,36,null,373,36,null,-303,36]
[null,null,null,0.374,0.374,23,null,3.75,36,null,374,36,null,-304,36]
[null,null,null,0.375,0.375,23,null,3.76,36,null,375,36,null,-305,36]
[null,null,null,0.376,0.376,23,null,3.77,36,null,376,36,null,-306,36]
[null,null,null,0.377,0.377,23,null,3.78,36,null,377,36,null,-307,36]
[null,null,null,0.378,0.378,23,null,3.79,36,null,378,36,null,-308,36]
[null,null,null,0.379,0.379,23,null,3.8,36,null,379,36,null,-309,36]
[null,null,null,0.38,0.38,23,null,3.81,36,null,380,36,null,-310,36]
[null,null,null,0.38100000000000001,0.38100000000000001,23,null,3.82,36,null,381,36,null,-311,36]
[null,null,null,0.38200000000000001,0.38200000000000001,23,null,3.83,36,null,382,36,null,-312,36]
[null,null,null,0.38300000000000001,0.38300000000000001,23,null,3.84,36,null,383,36,null,-313,36]
[null,null,null,0.38400000000000001,0.38400000000000001,23,null,3.85,36,null,384,36,null,-314,36]
[null,null,null,0.38500000000000001,{"$f":"FLOOR(D387,0.001)","v":0.38500000000000001},23,null,3.86,36,null,385,36,null,-315,36]
[null,null,null,0.38600000000000001,0.38600000000000001,23,null,3.87,36,null,386,36,null,-316,36]
[null,null,null,0.38700000000000001,0.38700000000000001,23,null,3.88,36,null,387,36,null,-317,36]
[null,null,null,0.38800000000000001,0.38800000000000001,23,null,3.89,36,null,388,36,null,-318,36]
[null,null,null,0.38900000000000001,0.38900000000000001,23,null,3.9,36,null,389,36,null,-319,36]
[null,null,null,0.39,0.39,23,null,3.91,36,null,390,36,null,-320,36]
[null,null,null,0.39100000000000001,0.39100000000000001,23,null,3.92,36,null,391,36,null,-321,36]
[null,null,null,0.39200000000000002,0.39200000000000002,23,null,3.93,36,null,392,36,null,-322,36]
[null,null,null,0.39300000000000002,0.39300000000000002,23,null,3.94,36,null,393,36,null,-323,36]
[null,null,null,0.39400000000000002,0.39400000000000002,23,null,3.95,36,null,394,36,null,-324,36]
[null,null,null,0.39500000000000002,0.39500000000000002,23,null,3.96,36,null,395,36,null,-325,36]
[null,null,null,0.39600000000000002,0.39600000000000002,23,null,3.97,36,null,396,36,null,-326,36]
[null,null,null,0.39700000000000002,0.39700000000000002,23,null,3.98,36,null,397,36,null,-327,36]
[null,null,null,0.39800000000000002,0.39800000000000002,23,null,3.99,36,null,398,36,null,-328,36]
[null,null,null,0.39900000000000002,0.39900000000000002,23,null,4,36,null,399,36,null,-329,36]
[null,null,null,0.4,0.4,24,null,4.01,36,null,400,36,null,-330,36]
[null,null,null,0.40100000000000002,0.40100000000000002,24,null,4.0199999999999996,36,null,401,36,null,-331,36]
[null,null,null,0.40200000000000002,0.40200000000000002,24,null,4.03,36,null,402,36,null,-332,36]
[null,null,null,0.40300000000000002,0.40300000000000002,24,null,4.04,36,null,403,36,null,-333,36]
[null,null,null,0.40400000000000003,0.40400000000000003,24,null,4.05,36,null,404,36,null,-334,36]
[null,null,null,0.40500000000000003,0.40500000000000003,24,null,4.0599999999999996,36,null,405,36,null,-335,36]
[null,null,null,0.40600000000000003,0.40600000000000003,24,null,4.07,36,null,406,36,null,-336,36]
[null,null,null,0.40699999999999997,0.40700000000000003,24,null,4.08,36,null,407,36,null,-337,36]
[null,null,null,0.40799999999999997,0.40800000000000003,24,null,4.09,36,null,408,36,null,-338,36]
[null,null,null,0.40899999999999997,0.40900000000000003,24,null,4.0999999999999996,36,null,409,36,null,-339,36]
[null,null,null,0.41,0.41000000000000003,24,null,4.1100000000000003,36,null,410,36,null,-340,36]
[null,null,null,0.41099999999999998,0.41100000000000003,24,null,4.12,36,null,411,36,null,-341,36]
[null,null,null,0.41199999999999998,0.41200000000000003,24,null,4.13,36,null,412,36,null,-342,36]
[null,null,null,0.41299999999999998,0.41300000000000003,24,null,4.1399999999999997,36,null,413,36,null,-343,36]
[null,null,null,0.41399999999999998,0.41400000000000003,24,null,4.1500000000000004,36,null,414,36,null,-344,36]
[null,null,null,0.41499999999999998,0.41500000000000004,24,null,4.16,36,null,415,36,null,-345,36]
[null,null,null,0.41599999999999998,0.41600000000000004,24,null,4.17,36,null,416,36,null,-346,36]
[null,null,null,0.41699999999999998,0.41699999999999998,24,null,4.18,36,null,417,36,null,-347,36]
[null,null,null,0.41799999999999998,0.41799999999999998,24,null,4.1900000000000004,36,null,418,36,null,-348,36]
[null,null,null,0.41899999999999998,0.41899999999999998,24,null,4.2,36,null,419,36,null,-349,36]
[null,null,null,0.42,0.42,24,null,4.21,36,null,420,36,null,-350,36]
[null,null,null,0.42099999999999999,0.42099999999999999,24,null,4.22,36,null,421,36,null,-351,36]
[null,null,null,0.42199999999999999,0.42199999999999999,24,null,4.2300000000000004,36,null,422,36,null,-352,36]
[null,null,null,0.42299999999999999,0.42299999999999999,24,null,4.24,36,null,423,36,null,-353,36]
[null,null,null,0.42399999999999999,0.42399999999999999,24,null,4.25,36,null,424,36,null,-354,36]
[null,null,null,0.42499999999999999,0.42499999999999999,24,null,4.26,36,null,425,36,null,-355,36]
[null,null,null,0.42599999999999999,0.42599999999999999,24,null,4.2699999999999996,36,null,426,36,null,-356,36]
[null,null,null,0.42699999999999999,0.42699999999999999,24,null,4.28,36,null,427,36,null,-357,36]
[null,null,null,0.42799999999999999,0.42799999999999999,24,null,4.29,36,null,428,36,null,-358,36]
[null,null,null,0.42899999999999999,0.42899999999999999,24,null,4.3,36,null,429,36,null,-359,36]
[null,null,null,0.43,0.43,24,null,4.3099999999999996,36,null,430,36,null,-360,36]
[null,null,null,0.43099999999999999,0.43099999999999999,24,null,4.32,36,null,431,36,null,-361,36]
[null,null,null,0.432,0.432,24,null,4.33,36,null,432,36,null,-362,36]
[null,null,null,0.433,0.433,24,null,4.34,36,null,433,36,null,-363,36]
[null,null,null,0.434,0.434,24,null,4.3499999999999996,36,null,434,36,null,-364,36]
[null,null,null,0.435,0.435,24,null,4.3600000000000003,36,null,435,36,null,-365,36]
[null,null,null,0.436,0.436,24,null,4.37,36,null,436,36,null,-366,36]
[null,null,null,0.437,0.437,24,null,4.38,36,null,437,36,null,-367,36]
[null,null,null,0.438,0.438,24,null,4.3899999999999997,36,null,438,36,null,-368,36]
[null,null,null,0.439,0.439,24,null,4.4000000000000004,36,null,439,36,null,-369,36]
[null,null,null,0.44,0.44,24,null,4.41,36,null,440,36,null,-370,36]
[null,null,null,0.441,0.441,24,null,4.42,36,null,441,36,null,-371,36]
[null,null,null,0.442,0.442,24,null,4.43,36,null,442,36,null,-372,36]
[null,null,null,0.443,0.443,24,null,4.4400000000000004,36,null,443,36,null,-373,36]
[null,null,null,0.44400000000000001,0.44400000000000001,24,null,4.45,36,null,444,36,null,-374,36]
[null,null,null,0.44500000000000001,0.44500000000000001,24,null,4.46,36,null,445,36,null,-375,36]
[null,null,null,0.44600000000000001,0.44600000000000001,24,null,4.47,36,null,446,36,null,-376,36]
[null,null,null,0.44700000000000001,0.44700000000000001,24,null,4.4800000000000004,36,null,447,36,null,-377,36]
[null,null,null,0.44800000000000001,0.44800000000000001,24,null,4.49,36,null,448,36,null,-378,36]
[null,null,null,0.44900000000000001,{"$f":"FLOOR(D451,0.001)","v":0.44900000000000001},24,null,4.5,36,null,449,36,null,-379,36]
[null,null,null,0.45,0.45,24,null,4.51,36,null,450,36,null,-380,36]
[null,null,null,0.45100000000000001,0.45100000000000001,24,null,4.5199999999999996,36,null,451,36,null,-381,36]
[null,null,null,0.45200000000000001,0.45200000000000001,24,null,4.53,36,null,452,36,null,-382,36]
[null,null,null,0.45300000000000001,0.45300000000000001,24,null,4.54,36,null,453,36,null,-383,36]
[null,null,null,0.45400000000000001,0.45400000000000001,24,null,4.55,36,null,454,36,null,-384,36]
[null,null,null,0.45500000000000002,0.45500000000000002,24,null,4.5599999999999996,36,null,455,36,null,-385,36]
[null,null,null,0.45600000000000002,0.45600000000000002,24,null,4.57,36,null,456,36,null,-386,36]
[null,null,null,0.45700000000000002,0.45700000000000002,24,null,4.58,36,null,457,36,null,-387,36]
[null,null,null,0.45800000000000002,0.45800000000000002,24,null,4.59,36,null,458,36,null,-388,36]
[null,null,null,0.45900000000000002,0.45900000000000002,24,null,4.5999999999999996,36,null,459,36,null,-389,36]
[null,null,null,0.46,0.46,24,null,4.6100000000000003,36,null,460,36,null,-390,36]
[null,null,null,0.46100000000000002,0.46100000000000002,24,null,4.62,36,null,461,36,null,-391,36]
[null,null,null,0.46200000000000002,0.46200000000000002,24,null,4.63,36,null,462,36,null,-392,36]
[null,null,null,0.46300000000000002,0.46300000000000002,24,null,4.6399999999999997,36,null,463,36,null,-393,36]
[null,null,null,0.46400000000000002,0.46400000000000002,24,null,4.6500000000000004,36,null,464,36,null,-394,36]
[null,null,null,0.46500000000000002,0.46500000000000002,24,null,4.66,36,null,465,36,null,-395,36]
[null,null,null,0.46600000000000003,0.46600000000000003,24,null,4.67,36,null,466,36,null,-396,36]
[null,null,null,0.46700000000000003,0.46700000000000003,24,null,4.68,36,null,467,36,null,-397,36]
[null,null,null,0.46800000000000003,0.46800000000000003,24,null,4.6900000000000004,36,null,468,36,null,-398,36]
[null,null,null,0.46899999999999997,0.46900000000000003,24,null,4.7,36,null,469,36,null,-399,36]
[null,null,null,0.47,0.47000000000000003,24,null,4.71,36,null,470,36,null,-400,36]
[null,null,null,0.47099999999999997,0.47100000000000003,24,null,4.72,36,null,471,36,null,-401,36]
[null,null,null,0.47199999999999998,0.47200000000000003,24,null,4.7300000000000004,36,null,472,36,null,-402,36]
[null,null,null,0.47299999999999998,0.47300000000000003,24,null,4.74,36,null,473,36,null,-403,36]
[null,null,null,0.47399999999999998,0.47400000000000003,24,null,4.75,36,null,474,36,null,-404,36]
[null,null,null,0.47499999999999998,0.47500000000000003,24,null,4.76,36,null,475,36,null,-405,36]
[null,null,null,0.47599999999999998,0.47600000000000003,24,null,4.7699999999999996,36,null,476,36,null,-406,36]
[null,null,null,0.47699999999999998,0.47700000000000004,24,null,4.78,36,null,477,36,null,-407,36]
[null,null,null,0.47799999999999998,0.47800000000000004,24,null,4.79,36,null,478,36,null,-408,36]
[null,null,null,0.47899999999999998,0.47900000000000004,24,null,4.8,36,null,479,36,null,-409,36]
[null,null,null,0.48,0.48,24,null,4.8099999999999996,36,null,480,36,null,-410,36]
[null,null,null,0.48099999999999998,0.48099999999999998,24,null,4.82,36,null,481,36,null,-411,36]
[null,null,null,0.48199999999999998,0.48199999999999998,24,null,4.83,36,null,482,36,null,-412,36]
[null,null,null,0.48299999999999998,0.48299999999999998,24,null,4.84,36,null,483,36,null,-413,36]
[null,null,null,0.48399999999999999,0.48399999999999999,24,null,4.8499999999999996,36,null,484,36,null,-414,36]
[null,null,null,0.48499999999999999,0.48499999999999999,24,null,4.8600000000000003,36,null,485,36,null,-415,36]
[null,null,null,0.48599999999999999,0.48599999999999999,24,null,4.87,36,null,486,36,null,-416,36]
[null,null,null,0.48699999999999999,0.48699999999999999,24,null,4.88,36,null,487,36,null,-417,36]
[null,null,null,0.48799999999999999,0.48799999999999999,24,null,4.8899999999999997,36,null,488,36,null,-418,36]
[null,null,null,0.48899999999999999,0.48899999999999999,24,null,4.9000000000000004,36,null,489,36,null,-419,36]
[null,null,null,0.49,0.49,24,null,4.91,36,null,490,36,null,-420,36]
[null,null,null,0.49099999999999999,0.49099999999999999,24,null,4.92,36,null,491,36,null,-421,36]
[null,null,null,0.49199999999999999,0.49199999999999999,24,null,4.93,36,null,492,36,null,-422,36]
[null,null,null,0.49299999999999999,0.49299999999999999,24,null,4.9400000000000004,36,null,493,36,null,-423,36]
[null,null,null,0.49399999999999999,0.49399999999999999,24,null,4.95,36,null,494,36,null,-424,36]
[null,null,null,0.495,0.495,24,null,4.96,36,null,495,36,null,-425,36]
[null,null,null,0.496,0.496,24,null,4.97,36,null,496,36,null,-426,36]
[null,null,null,0.497,0.497,24,null,4.9800000000000004,36,null,497,36,null,-427,36]
[null,null,null,0.498,0.498,24,null,4.99,36,null,498,36,null,-428,36]
[null,null,null,0.499,0.499,24,null,5,36,null,499,36,null,-429,36]
[null,null,null,0.5,0.5,25,null,5.01,36,null,500,36,null,-430,36]
[null,null,null,0.501,0.501,25,null,5.0199999999999996,36,null,501,36,null,-431,36]
[null,null,null,0.502,0.502,25,null,5.03,36,null,502,36,null,-432,36]
[null,null,null,0.503,0.503,25,null,5.04,36,null,503,36,null,-433,36]
[null,null,null,0.504,0.504,25,null,5.05,36,null,504,36,null,-434,36]
[null,null,null,0.505,0.505,25,null,5.0599999999999996,36,null,505,36,null,-435,36]
[null,null,null,0.50600000000000001,0.50600000000000001,25,null,5.07,36,null,506,36,null,-436,36]
[null,null,null,0.50700000000000001,0.50700000000000001,25,null,5.08,36,null,507,36,null,-437,36]
[null,null,null,0.50800000000000001,0.50800000000000001,25,null,5.09,36,null,508,36,null,-438,36]
[null,null,null,0.50900000000000001,0.50900000000000001,25,null,5.0999999999999996,36,null,509,36,null,-439,36]
[null,null,null,0.51,0.51,25,null,5.1100000000000003,36,null,510,36,null,-440,36]
[null,null,null,0.51100000000000001,0.51100000000000001,25,null,5.12,36,null,511,36,null,-441,36]
[null,null,null,0.51200000000000001,0.51200000000000001,25,null,5.13,36,null,512,36,null,-442,36]
[null,null,null,0.51300000000000001,{"$f":"FLOOR(D515,0.001)","v":0.51300000000000001},25,null,5.14,36,null,513,36,null,-443,36]
[null,null,null,0.51400000000000001,0.51400000000000001,25,null,5.15,36,null,514,36,null,-444,36]
[null,null,null,0.51500000000000001,0.51500000000000001,25,null,5.16,36,null,515,36,null,-445,36]
[null,null,null,0.51600000000000001,0.51600000000000001,25,null,5.17,36,null,516,36,null,-446,36]
[null,null,null,0.51700000000000002,0.51700000000000002,25,null,5.18,36,null,517,36,null,-447,36]
[null,null,null,0.51800000000000002,0.51800000000000002,25,null,5.19,36,null,518,36,null,-448,36]
[null,null,null,0.51900000000000002,0.51900000000000002,25,null,5.2,36,null,519,36,null,-449,36]
[null,null,null,0.52,0.52,25,null,5.21,36,null,520,36,null,-450,36]
[null,null,null,0.52100000000000002,0.52100000000000002,25,null,5.22,36,null,521,36,null,-451,36]
[null,null,null,0.52200000000000002,0.52200000000000002,25,null,5.23,36,null,522,36,null,-452,36]
[null,null,null,0.52300000000000002,0.52300000000000002,25,null,5.24,36,null,523,36,null,-453,36]
[null,null,null,0.52400000000000002,0.52400000000000002,25,null,5.25,36,null,524,36,null,-454,36]
[null,null,null,0.52500000000000002,0.52500000000000002,25,null,5.26,36,null,525,36,null,-455,36]
[null,null,null,0.52600000000000002,0.52600000000000002,25,null,5.27,36,null,526,36,null,-456,36]
[null,null,null,0.52700000000000002,0.52700000000000002,25,null,5.28,36,null,527,36,null,-457,36]
[null,null,null,0.52800000000000002,0.52800000000000002,25,null,5.29,36,null,528,36,null,-458,36]
[null,null,null,0.52900000000000003,0.52900000000000003,25,null,5.3,36,null,529,36,null,-459,36]
[null,null,null,0.53,0.53,25,null,5.31,36,null,530,36,null,-460,36]
[null,null,null,0.53100000000000003,0.53100000000000003,25,null,5.32,36,null,531,36,null,-461,36]
[null,null,null,0.53200000000000003,0.53200000000000003,25,null,5.33,36,null,532,36,null,-462,36]
[null,null,null,0.53300000000000003,0.53300000000000003,25,null,5.34,36,null,533,36,null,-463,36]
[null,null,null,0.53400000000000003,0.53400000000000003,25,null,5.35,36,null,534,36,null,-464,36]
[null,null,null,0.53500000000000003,0.53500000000000003,25,null,5.36,36,null,535,36,null,-465,36]
[null,null,null,0.53600000000000003,0.53600000000000003,25,null,5.37,36,null,536,36,null,-466,36]
[null,null,null,0.53700000000000003,0.53700000000000003,25,null,5.38,36,null,537,36,null,-467,36]
[null,null,null,0.53800000000000003,0.53800000000000003,25,null,5.39,36,null,538,36,null,-468,36]
[null,null,null,0.53900000000000003,0.53900000000000003,25,null,5.4,36,null,539,36,null,-469,36]
[null,null,null,0.54,0.54,25,null,5.41,36,null,540,36,null,-470,36]
[null,null,null,0.54100000000000004,0.54100000000000004,25,null,5.42,36,null,541,36,null,-471,36]
[null,null,null,0.54200000000000004,0.54200000000000004,25,null,5.43,36,null,542,36,null,-472,36]
[null,null,null,0.54300000000000004,0.54300000000000004,25,null,5.44,36,null,543,36,null,-473,36]
[null,null,null,0.54400000000000004,0.54400000000000004,25,null,5.45,36,null,544,36,null,-474,36]
[null,null,null,0.54500000000000004,0.54500000000000004,25,null,5.46,36,null,545,36,null,-475,36]
[null,null,null,0.54600000000000004,0.54600000000000004,25,null,5.47,36,null,546,36,null,-476,36]
[null,null,null,0.54700000000000004,0.54700000000000004,25,null,5.48,36,null,547,36,null,-477,36]
[null,null,null,0.54800000000000004,0.54800000000000004,25,null,5.49,36,null,548,36,null,-478,36]
[null,null,null,0.54900000000000004,0.54900000000000004,25,null,5.5,36,null,549,36,null,-479,36]
[null,null,null,0.55000000000000004,0.55000000000000004,25,null,5.51,36,null,550,36,null,-480,36]
[null,null,null,0.55100000000000005,0.55100000000000005,25,null,5.52,36,null,551,36,null,-481,36]
[null,null,null,0.55200000000000005,0.55200000000000005,25,null,5.53,36,null,552,36,null,-482,36]
[null,null,null,0.55300000000000005,0.55300000000000005,25,null,5.54,36,null,553,36,null,-483,36]
[null,null,null,0.55400000000000005,0.55400000000000005,25,null,5.55,36,null,554,36,null,-484,36]
[null,null,null,0.55500000000000005,0.55500000000000005,25,null,5.56,36,null,555,36,null,-485,36]
[null,null,null,0.55600000000000005,0.55600000000000005,25,null,5.57,36,null,556,36,null,-486,36]
[null,null,null,0.55700000000000005,0.55700000000000005,25,null,5.58,36,null,557,36,null,-487,36]
[null,null,null,0.55800000000000005,0.55800000000000005,25,null,5.59,36,null,558,36,null,-488,36]
[null,null,null,0.55900000000000005,0.55900000000000005,25,null,5.6,36,null,559,36,null,-489,36]
[null,null,null,0.56000000000000005,0.56000000000000005,25,null,5.61,36,null,560,36,null,-490,36]
[null,null,null,0.56100000000000005,0.56100000000000005,25,null,5.62,36,null,561,36,null,-491,36]
[null,null,null,0.56200000000000006,0.56200000000000006,25,null,5.63,36,null,562,36,null,-492,36]
[null,null,null,0.56299999999999994,0.56300000000000006,25,null,5.64,36,null,563,36,null,-493,36]
[null,null,null,0.56399999999999995,0.56400000000000006,25,null,5.65,36,null,564,36,null,-494,36]
[null,null,null,0.56499999999999995,0.56500000000000006,25,null,5.66,36,null,565,36,null,-495,36]
[null,null,null,0.56599999999999995,0.56600000000000006,25,null,5.67,36,null,566,36,null,-496,36]
[null,null,null,0.56699999999999995,0.56700000000000006,25,null,5.68,36,null,567,36,null,-497,36]
[null,null,null,0.56799999999999995,0.56800000000000006,25,null,5.69,36,null,568,36,null,-498,36]
[null,null,null,0.56899999999999995,0.56900000000000006,25,null,5.7,36,null,569,36,null,-499,36]
[null,null,null,0.56999999999999995,0.57000000000000006,25,null,5.71,36,null,570,36,null,-500,36]
[null,null,null,0.57099999999999995,0.57100000000000006,25,null,5.72,36,null,571,36,null,-501,36]
[null,null,null,0.57199999999999995,0.57200000000000006,25,null,5.73,36,null,572,36,null,-502,36]
[null,null,null,0.57299999999999995,0.57300000000000006,25,null,5.74,36,null,573,36,null,-503,36]
[null,null,null,0.57399999999999995,0.57400000000000007,25,null,5.75,36,null,574,36,null,-504,36]
[null,null,null,0.57499999999999996,0.57500000000000007,25,null,5.76,36,null,575,36,null,-505,36]
[null,null,null,0.57599999999999996,0.57600000000000007,25,null,5.77,36,null,576,36,null,-506,36]
[null,null,null,0.57699999999999996,{"$f":"FLOOR(D579,0.001)","v":0.57699999999999996},25,null,5.78,36,null,577,36,null,-507,36]
[null,null,null,0.57799999999999996,0.57799999999999996,25,null,5.79,36,null,578,36,null,-508,36]
[null,null,null,0.57899999999999996,0.57899999999999996,25,null,5.8,36,null,579,36,null,-509,36]
[null,null,null,0.57999999999999996,0.57999999999999996,25,null,5.81,36,null,580,36,null,-510,36]
[null,null,null,0.58099999999999996,0.58099999999999996,25,null,5.82,36,null,581,36,null,-511,36]
[null,null,null,0.58199999999999996,0.58199999999999996,25,null,5.83,36,null,582,36,null,-512,36]
[null,null,null,0.58299999999999996,0.58299999999999996,25,null,5.84,36,null,583,36,null,-513,36]
[null,null,null,0.58399999999999996,0.58399999999999996,25,null,5.85,36,null,584,36,null,-514,36]
[null,null,null,0.58499999999999996,0.58499999999999996,25,null,5.86,36,null,585,36,null,-515,36]
[null,null,null,0.58599999999999997,0.58599999999999997,25,null,5.87,36,null,586,36,null,-516,36]
[null,null,null,0.58699999999999997,0.58699999999999997,25,null,5.88,36,null,587,36,null,-517,36]
[null,null,null,0.58799999999999997,0.58799999999999997,25,null,5.89,36,null,588,36,null,-518,36]
[null,null,null,0.58899999999999997,0.58899999999999997,25,null,5.9,36,null,589,36,null,-519,36]
[null,null,null,0.59,0.59,25,null,5.91,36,null,590,36,null,-520,36]
[null,null,null,0.59099999999999997,0.59099999999999997,25,null,5.92,36,null,591,36,null,-521,36]
[null,null,null,0.59199999999999997,0.59199999999999997,25,null,5.93,36,null,592,36,null,-522,36]
[null,null,null,0.59299999999999997,0.59299999999999997,25,null,5.94,36,null,593,36,null,-523,36]
[null,null,null,0.59399999999999997,0.59399999999999997,25,null,5.95,36,null,594,36,null,-524,36]
[null,null,null,0.59499999999999997,0.59499999999999997,25,null,5.96,36,null,595,36,null,-525,36]
[null,null,null,0.59599999999999997,0.59599999999999997,25,null,5.97,36,null,596,36,null,-526,36]
[null,null,null,0.59699999999999998,0.59699999999999998,25,null,5.98,36,null,597,36,null,-527,36]
[null,null,null,0.59799999999999998,0.59799999999999998,25,null,5.99,36,null,598,36,null,-528,36]
[null,null,null,0.59899999999999998,0.59899999999999998,25,null,6,36,null,599,36,null,-529,36]
[null,null,null,0.6,0.6,26,null,6.01,36,null,600,36,null,-530,36]
[null,null,null,0.60099999999999998,0.60099999999999998,26,null,6.02,36,null,601,36,null,-531,36]
[null,null,null,0.60199999999999998,0.60199999999999998,26,null,6.03,36,null,602,36,null,-532,36]
[null,null,null,0.60299999999999998,0.60299999999999998,26,null,6.04,36,null,603,36,null,-533,36]
[null,null,null,0.60399999999999998,0.60399999999999998,26,null,6.05,36,null,604,36,null,-534,36]
[null,null,null,0.60499999999999998,0.60499999999999998,26,null,6.06,36,null,605,36,null,-535,36]
[null,null,null,0.60599999999999998,0.60599999999999998,26,null,6.07,36,null,606,36,null,-536,36]
[null,null,null,0.60699999999999998,0.60699999999999998,26,null,6.08,36,null,607,36,null,-537,36]
[null,null,null,0.60799999999999998,0.60799999999999998,26,null,6.09,36,null,608,36,null,-538,36]
[null,null,null,0.60899999999999999,0.60899999999999999,26,null,6.1,36,null,609,36,null,-539,36]
[null,null,null,0.61,0.61,26,null,6.11,36,null,610,36,null,-540,36]
[null,null,null,0.61099999999999999,0.61099999999999999,26,null,6.12,36,null,611,36,null,-541,36]
[null,null,null,0.61199999999999999,0.61199999999999999,26,null,6.13,36,null,612,36,null,-542,36]
[null,null,null,0.61299999999999999,0.61299999999999999,26,null,6.14,36,null,613,36,null,-543,36]
[null,null,null,0.61399999999999999,0.61399999999999999,26,null,6.15,36,null,614,36,null,-544,36]
[null,null,null,0.61499999999999999,0.61499999999999999,26,null,6.16,36,null,615,36,null,-545,36]
[null,null,null,0.61599999999999999,0.61599999999999999,26,null,6.17,36,null,616,36,null,-546,36]
[null,null,null,0.61699999999999999,0.61699999999999999,26,null,6.18,36,null,617,36,null,-547,36]
[null,null,null,0.61799999999999999,0.61799999999999999,26,null,6.19,36,null,618,36,null,-548,36]
[null,null,null,0.61899999999999999,0.61899999999999999,26,null,6.2,36,null,619,36,null,-549,36]
[null,null,null,0.62,0.62,26,null,6.21,36,null,620,36,null,-550,36]
[null,null,null,0.621,0.621,26,null,6.22,36,null,621,36,null,-551,36]
[null,null,null,0.622,0.622,26,null,6.23,36,null,622,36,null,-552,36]
[null,null,null,0.623,0.623,26,null,6.24,36,null,623,36,null,-553,36]
[null,null,null,0.624,0.624,26,null,6.25,36,null,624,36,null,-554,36]
[null,null,null,0.625,0.625,26,null,6.26,36,null,625,36,null,-555,36]
[null,null,null,0.626,0.626,26,null,6.27,36,null,626,36,null,-556,36]
[null,null,null,0.627,0.627,26,null,6.28,36,null,627,36,null,-557,36]
[null,null,null,0.628,0.628,26,null,6.29,36,null,628,36,null,-558,36]
[null,null,null,0.629,0.629,26,null,6.3,36,null,629,36,null,-559,36]
[null,null,null,0.63,0.63,26,null,6.31,36,null,630,36,null,-560,36]
[null,null,null,0.63100000000000001,0.63100000000000001,26,null,6.32,36,null,631,36,null,-561,36]
[null,null,null,0.63200000000000001,0.63200000000000001,26,null,6.33,36,null,632,36,null,-562,36]
[null,null,null,0.63300000000000001,0.63300000000000001,26,null,6.34,36,null,633,36,null,-563,36]
[null,null,null,0.63400000000000001,0.63400000000000001,26,null,6.35,36,null,634,36,null,-564,36]
[null,null,null,0.63500000000000001,0.63500000000000001,26,null,6.36,36,null,635,36,null,-565,36]
[null,null,null,0.63600000000000001,0.63600000000000001,26,null,6.37,36,null,636,36,null,-566,36]
[null,null,null,0.63700000000000001,0.63700000000000001,26,null,6.38,36,null,637,36,null,-567,36]
[null,null,null,0.63800000000000001,0.63800000000000001,26,null,6.39,36,null,638,36,null,-568,36]
[null,null,null,0.63900000000000001,0.63900000000000001,26,null,6.4,36,null,639,36,null,-569,36]
[null,null,null,0.64,0.64,26,null,6.41,36,null,640,36,null,-570,36]
[null,null,null,0.64100000000000001,{"$f":"FLOOR(D643,0.001)","v":0.64100000000000001},26,null,6.42,36,null,641,36,null,-571,36]
[null,null,null,0.64200000000000101,0.64200000000000002,26,null,6.43,36,null,642,36,null,-572,36]
[null,null,null,0.64300000000000102,0.64300000000000002,26,null,6.44,36,null,643,36,null,-573,36]
[null,null,null,0.64400000000000102,0.64400000000000002,26,null,6.45,36,null,644,36,null,-574,36]
[null,null,null,0.64500000000000102,0.64500000000000002,26,null,6.46,36,null,645,36,null,-575,36]
[null,null,null,0.64600000000000102,0.64600000000000002,26,null,6.47,36,null,646,36,null,-576,36]
[null,null,null,0.64700000000000102,0.64700000000000002,26,null,6.48,36,null,647,36,null,-577,36]
[null,null,null,0.64800000000000102,0.64800000000000002,26,null,6.49,36,null,648,36,null,-578,36]
[null,null,null,0.64900000000000102,0.64900000000000002,26,null,6.5,36,null,649,36,null,-579,36]
[null,null,null,0.65000000000000102,0.65,26,null,6.51,36,null,650,36,null,-580,36]
[null,null,null,0.65100000000000102,0.65100000000000002,26,null,6.52,36,null,651,36,null,-581,36]
[null,null,null,0.65200000000000102,0.65200000000000002,26,null,6.53,36,null,652,36,null,-582,36]
[null,null,null,0.65300000000000102,0.65300000000000002,26,null,6.54,36,null,653,36,null,-583,36]
[null,null,null,0.65400000000000102,0.65400000000000003,26,null,6.55,36,null,654,36,null,-584,36]
[null,null,null,0.65500000000000103,0.65500000000000003,26,null,6.56,36,null,655,36,null,-585,36]
[null,null,null,0.65600000000000103,0.65600000000000003,26,null,6.57,36,null,656,36,null,-586,36]
[null,null,null,0.65700000000000103,0.65700000000000003,26,null,6.58,36,null,657,36,null,-587,36]
[null,null,null,0.65800000000000103,0.65800000000000003,26,null,6.59,36,null,658,36,null,-588,36]
[null,null,null,0.65900000000000103,0.65900000000000003,26,null,6.6,36,null,659,36,null,-589,36]
[null,null,null,0.66000000000000103,0.66,26,null,6.61,36,null,660,36,null,-590,36]
[null,null,null,0.66100000000000103,0.66100000000000003,26,null,6.62,36,null,661,36,null,-591,36]
[null,null,null,0.66200000000000103,0.66200000000000003,26,null,6.63,36,null,662,36,null,-592,36]
[null,null,null,0.66300000000000103,0.66300000000000003,26,null,6.64,36,null,663,36,null,-593,36]
[null,null,null,0.66400000000000103,0.66400000000000003,26,null,6.65,36,null,664,36,null,-594,36]
[null,null,null,0.66500000000000103,0.66500000000000004,26,null,6.66,36,null,null,null,null,-595,36]
[null,null,null,0.66600000000000104,0.66600000000000004,26,null,6.67,36,null,null,null,null,-596,36]
[null,null,null,0.66700000000000104,0.66700000000000004,26,null,6.68,36,null,null,null,null,-597,36]
[null,null,null,0.66800000000000104,0.66800000000000004,26,null,6.69,36,null,null,null,null,-598,36]
[null,null,null,0.66900000000000104,0.66900000000000004,26,null,6.7,36,null,null,null,null,-599,36]
[null,null,null,0.67000000000000104,0.67,26,null,6.71,36,null,null,null,null,-600,36]
[null,null,null,0.67100000000000104,0.67100000000000004,26,null,6.72,36,null,null,null,null,-601,36]
[null,null,null,0.67200000000000104,0.67200000000000004,26,null,6.73,36,null,null,null,null,-602,36]
[null,null,null,0.67300000000000104,0.67300000000000004,26,null,6.74,36,null,null,null,null,-603,36]
[null,null,null,0.67400000000000104,0.67400000000000004,26,null,6.75,36,null,null,null,null,-604,36]
[null,null,null,0.67500000000000104,0.67500000000000004,26,null,6.76,36,null,null,null,null,-605,36]
[null,null,null,0.67600000000000104,0.67600000000000005,26,null,6.77,36,null,null,null,null,-606,36]
[null,null,null,0.67700000000000105,0.67700000000000005,26,null,6.78,36,null,null,null,null,-607,36]
[null,null,null,0.67800000000000105,0.67800000000000005,26,null,6.79,36,null,null,null,null,-608,36]
[null,null,null,0.67900000000000105,0.67900000000000005,26,null,6.8,36,null,null,null,null,-609,36]
[null,null,null,0.68000000000000105,0.68,26,null,6.8100000000000103,36,null,null,null,null,-610,36]
[null,null,null,0.68100000000000105,0.68100000000000005,26,null,6.82,36,null,null,null,null,-611,36]
[null,null,null,0.68200000000000105,0.68200000000000005,26,null,6.83,36,null,null,null,null,-612,36]
[null,null,null,0.68300000000000105,0.68300000000000005,26,null,6.84,36,null,null,null,null,-613,36]
[null,null,null,0.68400000000000105,0.68400000000000005,26,null,6.85,36,null,null,null,null,-614,36]
[null,null,null,0.68500000000000105,0.68500000000000005,26,null,6.86,36,null,null,null,null,-615,36]
[null,null,null,0.68600000000000105,0.68600000000000005,26,null,6.87,36,null,null,null,null,-616,36]
[null,null,null,0.68700000000000105,0.68700000000000006,26,null,6.88,36,null,null,null,null,-617,36]
[null,null,null,0.68800000000000106,0.68800000000000006,26,null,6.8900000000000103,36,null,null,null,null,-618,36]
[null,null,null,0.68900000000000095,0.68900000000000006,26,null,6.9,36,null,null,null,null,-619,36]
[null,null,null,0.69000000000000095,0.69000000000000006,26,null,6.91,36,null,null,null,null,-620,36]
[null,null,null,0.69100000000000095,0.69100000000000006,26,null,6.92,36,null,null,null,null,-621,36]
[null,null,null,0.69200000000000095,0.69200000000000006,26,null,6.93,36,null,null,null,null,-622,36]
[null,null,null,0.69300000000000095,0.69300000000000006,26,null,6.94,36,null,null,null,null,-623,36]
[null,null,null,0.69400000000000095,0.69400000000000006,26,null,6.95,36,null,null,null,null,-624,36]
[null,null,null,0.69500000000000095,0.69500000000000006,26,null,6.96,36,null,null,null,null,-625,36]
[null,null,null,0.69600000000000095,0.69600000000000006,26,null,6.9700000000000104,36,null,null,null,null,-626,36]
[null,null,null,0.69700000000000095,0.69700000000000006,26,null,6.98,36,null,null,null,null,-627,36]
[null,null,null,0.69800000000000095,0.69800000000000006,26,null,6.99,36,null,null,null,null,-628,36]
[null,null,null,0.69900000000000095,0.69900000000000007,26,null,7,36,null,null,null,null,-629,36]
[null,null,null,0.70000000000000095,0.70000000000000007,27,null,7.01,36,null,null,null,null,-630,36]
[null,null,null,0.70100000000000096,0.70100000000000007,27,null,7.0200000000000102,36,null,null,null,null,-631,36]
[null,null,null,0.70200000000000096,0.70200000000000007,27,null,7.03,36,null,null,null,null,-632,36]
[null,null,null,0.70300000000000096,0.70300000000000007,27,null,7.04,36,null,null,null,null,-633,36]
[null,null,null,0.70400000000000096,0.70399999999999996,27,null,7.0500000000000096,36,null,null,null,null,-634,36]
[null,null,null,0.70500000000000096,{"$f":"FLOOR(D707,0.001)","v":0.70499999999999996},27,null,7.0600000000000103,36,null,null,null,null,-635,36]
[null,null,null,0.70600000000000096,0.70599999999999996,27,null,7.07,36,null,null,null,null,-636,36]
[null,null,null,0.70700000000000096,0.70699999999999996,27,null,7.08,36,null,null,null,null,-637,36]
[null,null,null,0.70800000000000096,0.70799999999999996,27,null,7.09,36,null,null,null,null,-638,36]
[null,null,null,0.70900000000000096,0.70899999999999996,27,null,7.1000000000000103,36,null,null,null,null,-639,36]
[null,null,null,0.71000000000000096,0.71,27,null,7.11,36,null,null,null,null,-640,36]
[null,null,null,0.71100000000000096,0.71099999999999997,27,null,7.12,36,null,null,null,null,-641,36]
[null,null,null,0.71200000000000097,0.71199999999999997,27,null,7.1300000000000097,36,null,null,null,null,-642,36]
[null,null,null,0.71300000000000097,0.71299999999999997,27,null,7.1400000000000103,36,null,null,null,null,-643,36]
[null,null,null,0.71400000000000097,0.71399999999999997,27,null,7.15,36,null,null,null,null,-644,36]
[null,null,null,0.71500000000000097,0.71499999999999997,27,null,7.16,36,null,null,null,null,-645,36]
[null,null,null,0.71600000000000097,0.71599999999999997,27,null,7.17,36,null,null,null,null,-646,36]
[null,null,null,0.71700000000000097,0.71699999999999997,27,null,7.1800000000000104,36,null,null,null,null,-647,36]
[null,null,null,0.71800000000000097,0.71799999999999997,27,null,7.19,36,null,null,null,null,-648,36]
[null,null,null,0.71900000000000097,0.71899999999999997,27,null,7.2,36,null,null,null,null,-649,36]
[null,null,null,0.72000000000000097,0.72,27,null,7.2100000000000097,36,null,null,null,null,-650,36]
[null,null,null,0.72100000000000097,0.72099999999999997,27,null,7.2200000000000104,36,null,null,null,null,-651,36]
[null,null,null,0.72200000000000097,0.72199999999999998,27,null,7.23,36,null,null,null,null,-652,36]
[null,null,null,0.72300000000000098,0.72299999999999998,27,null,7.24,36,null,null,null,null,-653,36]
[null,null,null,0.72400000000000098,0.72399999999999998,27,null,7.25,36,null,null,null,null,-654,36]
[null,null,null,0.72500000000000098,0.72499999999999998,27,null,7.2600000000000096,36,null,null,null,null,-655,36]
[null,null,null,0.72600000000000098,0.72599999999999998,27,null,7.2700000000000102,36,null,null,null,null,-656,36]
[null,null,null,0.72700000000000098,0.72699999999999998,27,null,7.28,36,null,null,null,null,-657,36]
[null,null,null,0.72800000000000098,0.72799999999999998,27,null,7.2900000000000098,36,null,null,null,null,-658,36]
[null,null,null,0.72900000000000098,0.72899999999999998,27,null,7.3000000000000096,36,null,null,null,null,-659,36]
[null,null,null,0.73000000000000098,0.73,27,null,7.3100000000000103,36,null,null,null,null,-660,36]
[null,null,null,0.73100000000000098,0.73099999999999998,27,null,7.32,36,null,null,null,null,-661,36]
[null,null,null,0.73200000000000098,0.73199999999999998,27,null,7.33,36,null,null,null,null,-662,36]
[null,null,null,0.73300000000000098,0.73299999999999998,27,null,7.3400000000000096,36,null,null,null,null,-663,36]
[null,null,null,0.73400000000000098,0.73399999999999999,27,null,7.3500000000000103,36,null,null,null,null,-664,36]
[null,null,null,0.73500000000000099,0.73499999999999999,27,null,7.36,36,null,null,null,null,-665,36]
[null,null,null,0.73600000000000099,0.73599999999999999,27,null,7.3700000000000099,36,null,null,null,null,-666,36]
[null,null,null,0.73700000000000099,0.73699999999999999,27,null,7.3800000000000097,36,null,null,null,null,-667,36]
[null,null,null,0.73800000000000099,0.73799999999999999,27,null,7.3900000000000103,36,null,null,null,null,-668,36]
[null,null,null,0.73900000000000099,0.73899999999999999,27,null,7.4,36,null,null,null,null,-669,36]
[null,null,null,0.74000000000000099,0.74,27,null,7.41,36,null,null,null,null,-670,36]
[null,null,null,0.74100000000000099,0.74099999999999999,27,null,7.4200000000000097,36,null,null,null,null,-671,36]
[null,null,null,0.74200000000000099,0.74199999999999999,27,null,7.4300000000000104,36,null,null,null,null,-672,36]
[null,null,null,0.74300000000000099,0.74299999999999999,27,null,7.44,36,null,null,null,null,-673,36]
[null,null,null,0.74400000000000099,0.74399999999999999,27,null,7.4500000000000099,36,null,null,null,null,-674,36]
[null,null,null,0.74500000000000099,0.745,27,null,7.4600000000000097,36,null,null,null,null,-675,36]
[null,null,null,0.746000000000001,0.746,27,null,7.4700000000000104,36,null,null,null,null,-676,36]
[null,null,null,0.747000000000001,0.747,27,null,7.48,36,null,null,null,null,-677,36]
[null,null,null,0.748000000000001,0.748,27,null,7.49,36,null,null,null,null,-678,36]
[null,null,null,0.749000000000001,0.749,27,null,7.5000000000000098,36,null,null,null,null,-679,36]
[null,null,null,0.750000000000001,0.75,27,null,7.5100000000000096,36,null,null,null,null,-680,36]
[null,null,null,0.751000000000001,0.751,27,null,7.5200000000000102,36]
[null,null,null,0.752000000000001,0.752,27,null,7.53000000000001,36]
[null,null,null,0.753000000000001,0.753,27,null,7.5400000000000098,36]
[null,null,null,0.754000000000001,0.754,27,null,7.5500000000000096,36]
[null,null,null,0.755000000000001,0.755,27,null,7.5600000000000103,36]
[null,null,null,0.756000000000001,0.75600000000000001,27,null,7.57,36]
[null,null,null,0.75700000000000101,0.75700000000000001,27,null,7.5800000000000098,36]
[null,null,null,0.75800000000000101,0.75800000000000001,27,null,7.5900000000000096,36]
[null,null,null,0.75900000000000101,0.75900000000000001,27,null,7.6000000000000103,36]
[null,null,null,0.76000000000000101,0.76,27,null,7.6100000000000101,36]
[null,null,null,0.76100000000000101,0.76100000000000001,27,null,7.6200000000000099,36]
[null,null,null,0.76200000000000101,0.76200000000000001,27,null,7.6300000000000097,36]
[null,null,null,0.76300000000000101,0.76300000000000001,27,null,7.6400000000000103,36]
[null,null,null,0.76400000000000101,0.76400000000000001,27,null,7.65,36]
[null,null,null,0.76500000000000101,0.76500000000000001,27,null,7.6600000000000099,36]
[null,null,null,0.76600000000000101,0.76600000000000001,27,null,7.6700000000000097,36]
[null,null,null,0.76700000000000101,0.76700000000000002,27,null,7.6800000000000104,36]
[null,null,null,0.76800000000000102,0.76800000000000002,27,null,7.6900000000000102,36]
[null,null,null,0.76900000000000102,{"$f":"FLOOR(D771,0.001)","v":0.76900000000000002},27,null,7.7000000000000099,36]
[null,null,null,0.77000000000000102,0.77,27,null,7.7100000000000097,36]
[null,null,null,0.77100000000000102,0.77100000000000002,27,null,7.7200000000000104,36]
[null,null,null,0.77200000000000102,0.77200000000000002,27,null,7.73,36]
[null,null,null,0.77300000000000102,0.77300000000000002,27,null,7.74000000000001,36]
[null,null,null,0.77400000000000102,0.77400000000000002,27,null,7.7500000000000098,36]
[null,null,null,0.77500000000000102,0.77500000000000002,27,null,7.7600000000000096,36]
[null,null,null,0.77600000000000102,0.77600000000000002,27,null,7.7700000000000102,36]
[null,null,null,0.77700000000000102,0.77700000000000002,27,null,7.78000000000001,36]
[null,null,null,0.77800000000000102,0.77800000000000002,27,null,7.7900000000000098,36]
[null,null,null,0.77900000000000102,0.77900000000000003,27,null,7.8000000000000096,36]
[null,null,null,0.78000000000000103,0.78,27,null,7.8100000000000103,36]
[null,null,null,0.78100000000000103,0.78100000000000003,27,null,7.8200000000000101,36]
[null,null,null,0.78200000000000103,0.78200000000000003,27,null,7.8300000000000098,36]
[null,null,null,0.78300000000000103,0.78300000000000003,27,null,7.8400000000000096,36]
[null,null,null,0.78400000000000103,0.78400000000000003,27,null,7.8500000000000103,36]
[null,null,null,0.78500000000000103,0.78500000000000003,27,null,7.8600000000000101,36]
[null,null,null,0.78600000000000103,0.78600000000000003,27,null,7.8700000000000099,36]
[null,null,null,0.78700000000000103,0.78700000000000003,27,null,7.8800000000000097,36]
[null,null,null,0.78800000000000103,0.78800000000000003,27,null,7.8900000000000103,36]
[null,null,null,0.78900000000000103,0.78900000000000003,27,null,7.9000000000000101,36]
[null,null,null,0.79000000000000103,0.79,27,null,7.9100000000000099,36]
[null,null,null,0.79100000000000104,0.79100000000000004,27,null,7.9200000000000097,36]
[null,null,null,0.79200000000000104,0.79200000000000004,27,null,7.9300000000000104,36]
[null,null,null,0.79300000000000104,0.79300000000000004,27,null,7.9400000000000102,36]
[null,null,null,0.79400000000000104,0.79400000000000004,27,null,7.9500000000000099,36]
[null,null,null,0.79500000000000104,0.79500000000000004,27,null,7.9600000000000097,36]
[null,null,null,0.79600000000000104,0.79600000000000004,27,null,7.9700000000000104,36]
[null,null,null,0.79700000000000104,0.79700000000000004,27,null,7.9800000000000102,36]
[null,null,null,0.79800000000000104,0.79800000000000004,27,null,7.99000000000001,36]
[null,null,null,0.79900000000000104,0.79900000000000004,27,null,8.0000000000000107,36]
[null,null,null,0.80000000000000104,0.8,28,null,8.0100000000000104,36]
[null,null,null,0.80100000000000104,0.80100000000000005,28,null,8.0200000000000102,36]
[null,null,null,0.80200000000000105,0.80200000000000005,28,null,8.03000000000001,36]
[null,null,null,0.80300000000000105,0.80300000000000005,28,null,8.0400000000000098,36]
[null,null,null,0.80400000000000105,0.80400000000000005,28,null,8.0500000000000096,36]
[null,null,null,0.80500000000000105,0.80500000000000005,28,null,8.0600000000000094,36]
[null,null,null,0.80600000000000105,0.80600000000000005,28,null,8.0700000000000092,36]
[null,null,null,0.80700000000000105,0.80700000000000005,28,null,8.0800000000000107,36]
[null,null,null,0.80800000000000105,0.80800000000000005,28,null,8.0900000000000105,36]
[null,null,null,0.80900000000000105,0.80900000000000005,28,null,8.1000000000000103,36]
[null,null,null,0.81000000000000105,0.81,28,null,8.1100000000000101,36]
[null,null,null,0.81100000000000105,0.81100000000000005,28,null,8.1200000000000099,36]
[null,null,null,0.81200000000000105,0.81200000000000006,28,null,8.1300000000000097,36]
[null,null,null,0.81300000000000106,0.81300000000000006,28,null,8.1400000000000095,36]
[null,null,null,0.81400000000000095,0.81400000000000006,28,null,8.1500000000000092,36]
[null,null,null,0.81500000000000095,0.81500000000000006,28,null,8.1600000000000108,36]
[null,null,null,0.81600000000000095,0.81600000000000006,28,null,8.1700000000000106,36]
[null,null,null,0.81700000000000095,0.81700000000000006,28,null,8.1800000000000104,36]
[null,null,null,0.81800000000000095,0.81800000000000006,28,null,8.1900000000000102,36]
[null,null,null,0.81900000000000095,0.81900000000000006,28,null,8.2000000000000099,36]
[null,null,null,0.82000000000000095,0.82000000000000006,28,null,8.2100000000000097,36]
[null,null,null,0.82100000000000095,0.82100000000000006,28,null,8.2200000000000095,36]
[null,null,null,0.82200000000000095,0.82200000000000006,28,null,8.2300000000000093,36]
[null,null,null,0.82300000000000095,0.82300000000000006,28,null,8.2400000000000109,36]
[null,null,null,0.82400000000000095,0.82400000000000007,28,null,8.2500000000000107,36]
[null,null,null,0.82500000000000095,0.82500000000000007,28,null,8.2600000000000104,36]
[null,null,null,0.82600000000000096,0.82600000000000007,28,null,8.2700000000000102,36]
[null,null,null,0.82700000000000096,0.82700000000000007,28,null,8.28000000000001,36]
[null,null,null,0.82800000000000096,0.82800000000000007,28,null,8.2900000000000098,36]
[null,null,null,0.82900000000000096,0.82900000000000007,28,null,8.3000000000000096,36]
[null,null,null,0.83000000000000096,0.83000000000000007,28,null,8.3100000000000094,36]
[null,null,null,0.83100000000000096,0.83100000000000007,28,null,8.3200000000000092,36]
[null,null,null,0.83200000000000096,0.83200000000000007,28,null,8.3300000000000107,36]
[null,null,null,0.83300000000000096,{"$f":"FLOOR(D835,0.001)","v":0.83299999999999996},28,null,8.3400000000000105,36]
[null,null,null,0.83400000000000096,0.83399999999999996,28,null,8.3500000000000103,36]
[null,null,null,0.83500000000000096,0.83499999999999996,28,null,8.3600000000000101,36]
[null,null,null,0.83600000000000096,0.83599999999999997,28,null,8.3700000000000099,36]
[null,null,null,0.83700000000000097,0.83699999999999997,28,null,8.3800000000000097,36]
[null,null,null,0.83800000000000097,0.83799999999999997,28,null,8.3900000000000095,36]
[null,null,null,0.83900000000000097,0.83899999999999997,28,null,8.4000000000000092,36]
[null,null,null,0.84000000000000097,0.84,28,null,8.4100000000000108,36]
[null,null,null,0.84100000000000097,0.84099999999999997,28,null,8.4200000000000106,36]
[null,null,null,0.84200000000000097,0.84199999999999997,28,null,8.4300000000000104,36]
[null,null,null,0.84300000000000097,0.84299999999999997,28,null,8.4400000000000102,36]
[null,null,null,0.84400000000000097,0.84399999999999997,28,null,8.4500000000000099,36]
[null,null,null,0.84500000000000097,0.84499999999999997,28,null,8.4600000000000097,36]
[null,null,null,0.84600000000000097,0.84599999999999997,28,null,8.4700000000000095,36]
[null,null,null,0.84700000000000097,0.84699999999999998,28,null,8.4800000000000093,36]
[null,null,null,0.84800000000000098,0.84799999999999998,28,null,8.4900000000000109,36]
[null,null,null,0.84900000000000098,0.84899999999999998,28,null,8.5000000000000107,36]
[null,null,null,0.85000000000000098,0.85,28,null,8.5100000000000104,36]
[null,null,null,0.85100000000000098,0.85099999999999998,28,null,8.5200000000000102,36]
[null,null,null,0.85200000000000098,0.85199999999999998,28,null,8.53000000000001,36]
[null,null,null,0.85300000000000098,0.85299999999999998,28,null,8.5400000000000098,36]
[null,null,null,0.85400000000000098,0.85399999999999998,28,null,8.5500000000000096,36]
[null,null,null,0.85500000000000098,0.85499999999999998,28,null,8.5600000000000094,36]
[null,null,null,0.85600000000000098,0.85599999999999998,28,null,8.5700000000000092,36]
[null,null,null,0.85700000000000098,0.85699999999999998,28,null,8.5800000000000107,36]
[null,null,null,0.85800000000000098,0.85799999999999998,28,null,8.5900000000000105,36]
[null,null,null,0.85900000000000098,0.85899999999999999,28,null,8.6000000000000103,36]
[null,null,null,0.86000000000000099,0.86,28,null,8.6100000000000101,36]
[null,null,null,0.86100000000000099,0.86099999999999999,28,null,8.6200000000000099,36]
[null,null,null,0.86200000000000099,0.86199999999999999,28,null,8.6300000000000097,36]
[null,null,null,0.86300000000000099,0.86299999999999999,28,null,8.6400000000000095,36]
[null,null,null,0.86400000000000099,0.86399999999999999,28,null,8.6500000000000092,36]
[null,null,null,0.86500000000000099,0.86499999999999999,28,null,8.6600000000000108,36]
[null,null,null,0.86600000000000099,0.86599999999999999,28,null,8.6700000000000106,36]
[null,null,null,0.86700000000000099,0.86699999999999999,28,null,8.6800000000000104,36]
[null,null,null,0.86800000000000099,0.86799999999999999,28,null,8.6900000000000102,36]
[null,null,null,0.86900000000000099,0.86899999999999999,28,null,8.7000000000000099,36]
[null,null,null,0.87000000000000099,0.87,28,null,8.7100000000000097,36]
[null,null,null,0.871000000000001,0.871,28,null,8.7200000000000095,36]
[null,null,null,0.872000000000001,0.872,28,null,8.7300000000000093,36]
[null,null,null,0.873000000000001,0.873,28,null,8.7400000000000109,36]
[null,null,null,0.874000000000001,0.874,28,null,8.7500000000000107,36]
[null,null,null,0.875000000000001,0.875,28,null,8.7600000000000104,36]
[null,null,null,0.876000000000001,0.876,28,null,8.7700000000000102,36]
[null,null,null,0.877000000000001,0.877,28,null,8.78000000000001,36]
[null,null,null,0.878000000000001,0.878,28,null,8.7900000000000098,36]
[null,null,null,0.879000000000001,0.879,28,null,8.8000000000000096,36]
[null,null,null,0.880000000000001,0.88,28,null,8.8100000000000094,36]
[null,null,null,0.881000000000001,0.88100000000000001,28,null,8.8200000000000092,36]
[null,null,null,0.88200000000000101,0.88200000000000001,28,null,8.8300000000000107,36]
[null,null,null,0.88300000000000101,0.88300000000000001,28,null,8.8400000000000105,36]
[null,null,null,0.88400000000000101,0.88400000000000001,28,null,8.8500000000000103,36]
[null,null,null,0.88500000000000101,0.88500000000000001,28,null,8.8600000000000101,36]
[null,null,null,0.88600000000000101,0.88600000000000001,28,null,8.8700000000000099,36]
[null,null,null,0.88700000000000101,0.88700000000000001,28,null,8.8800000000000097,36]
[null,null,null,0.88800000000000101,0.88800000000000001,28,null,8.8900000000000095,36]
[null,null,null,0.88900000000000101,0.88900000000000001,28,null,8.9000000000000092,36]
[null,null,null,0.89000000000000101,0.89,28,null,8.9100000000000108,36]
[null,null,null,0.89100000000000101,0.89100000000000001,28,null,8.9200000000000106,36]
[null,null,null,0.89200000000000101,0.89200000000000002,28,null,8.9300000000000104,36]
[null,null,null,0.89300000000000102,0.89300000000000002,28,null,8.9400000000000102,36]
[null,null,null,0.89400000000000102,0.89400000000000002,28,null,8.9500000000000099,36]
[null,null,null,0.89500000000000102,0.89500000000000002,28,null,8.9600000000000097,36]
[null,null,null,0.89600000000000102,0.89600000000000002,28,null,8.9700000000000095,36]
[null,null,null,0.89700000000000102,{"$f":"FLOOR(D899,0.001)","v":0.89700000000000002},28,null,8.9800000000000093,36]
[null,null,null,0.89800000000000102,0.89800000000000002,28,null,8.9900000000000109,36]
[null,null,null,0.89900000000000102,0.89900000000000002,28,null,9.0000000000000107,36]
[null,null,null,0.90000000000000102,0.9,29,null,9.0100000000000104,36]
[null,null,null,0.90100000000000102,0.90100000000000002,29,null,9.0200000000000102,36]
[null,null,null,0.90200000000000102,0.90200000000000002,29,null,9.03000000000001,36]
[null,null,null,0.90300000000000102,0.90300000000000002,29,null,9.0400000000000098,36]
[null,null,null,0.90400000000000102,0.90400000000000003,29,null,9.0500000000000096,36]
[null,null,null,0.90500000000000103,0.90500000000000003,29,null,9.0600000000000094,36]
[null,null,null,0.90600000000000103,0.90600000000000003,29,null,9.0700000000000092,36]
[null,null,null,0.90700000000000103,0.90700000000000003,29,null,9.0800000000000107,36]
[null,null,null,0.90800000000000103,0.90800000000000003,29,null,9.0900000000000105,36]
[null,null,null,0.90900000000000103,0.90900000000000003,29,null,9.1000000000000103,36]
[null,null,null,0.91000000000000103,0.91,29,null,9.1100000000000101,36]
[null,null,null,0.91100000000000103,0.91100000000000003,29,null,9.1200000000000099,36]
[null,null,null,0.91200000000000103,0.91200000000000003,29,null,9.1300000000000097,36]
[null,null,null,0.91300000000000103,0.91300000000000003,29,null,9.1400000000000095,36]
[null,null,null,0.91400000000000103,0.91400000000000003,29,null,9.1500000000000092,36]
[null,null,null,0.91500000000000103,0.91500000000000004,29,null,9.1600000000000108,36]
[null,null,null,0.91600000000000104,0.91600000000000004,29,null,9.1700000000000106,36]
[null,null,null,0.91700000000000104,0.91700000000000004,29,null,9.1800000000000104,36]
[null,null,null,0.91800000000000104,0.91800000000000004,29,null,9.1900000000000102,36]
[null,null,null,0.91900000000000104,0.91900000000000004,29,null,9.2000000000000099,36]
[null,null,null,0.92000000000000104,0.92,29,null,9.2100000000000097,36]
[null,null,null,0.92100000000000104,0.92100000000000004,29,null,9.2200000000000095,36]
[null,null,null,0.92200000000000104,0.92200000000000004,29,null,9.2300000000000093,36]
[null,null,null,0.92300000000000104,0.92300000000000004,29,null,9.2400000000000109,36]
[null,null,null,0.92400000000000104,0.92400000000000004,29,null,9.2500000000000107,36]
[null,null,null,0.92500000000000104,0.92500000000000004,29,null,9.2600000000000104,36]
[null,null,null,0.92600000000000104,0.92600000000000005,29,null,9.2700000000000102,36]
[null,null,null,0.92700000000000105,0.92700000000000005,29,null,9.28000000000001,36]
[null,null,null,0.92800000000000105,0.92800000000000005,29,null,9.2900000000000098,36]
[null,null,null,0.92900000000000105,0.92900000000000005,29,null,9.3000000000000096,36]
[null,null,null,0.93000000000000105,0.93,29,null,9.3100000000000094,36]
[null,null,null,0.93100000000000105,0.93100000000000005,29,null,9.3200000000000092,36]
[null,null,null,0.93200000000000105,0.93200000000000005,29,null,9.3300000000000107,36]
[null,null,null,0.93300000000000105,0.93300000000000005,29,null,9.3400000000000105,36]
[null,null,null,0.93400000000000105,0.93400000000000005,29,null,9.3500000000000103,36]
[null,null,null,0.93500000000000105,0.93500000000000005,29,null,9.3600000000000101,36]
[null,null,null,0.93600000000000105,0.93600000000000005,29,null,9.3700000000000099,36]
[null,null,null,0.93700000000000105,0.93700000000000006,29,null,9.3800000000000097,36]
[null,null,null,0.93800000000000106,0.93800000000000006,29,null,9.3900000000000095,36]
[null,null,null,0.93900000000000095,0.93900000000000006,29,null,9.4000000000000092,36]
[null,null,null,0.94000000000000095,0.94000000000000006,29,null,9.4100000000000108,36]
[null,null,null,0.94100000000000095,0.94100000000000006,29,null,9.4200000000000106,36]
[null,null,null,0.94200000000000095,0.94200000000000006,29,null,9.4300000000000104,36]
[null,null,null,0.94300000000000095,0.94300000000000006,29,null,9.4400000000000102,36]
[null,null,null,0.94400000000000095,0.94400000000000006,29,null,9.4500000000000099,36]
[null,null,null,0.94500000000000095,0.94500000000000006,29,null,9.4600000000000097,36]
[null,null,null,0.94600000000000095,0.94600000000000006,29,null,9.4700000000000095,36]
[null,null,null,0.94700000000000095,0.94700000000000006,29,null,9.4800000000000093,36]
[null,null,null,0.94800000000000095,0.94800000000000006,29,null,9.4900000000000109,36]
[null,null,null,0.94900000000000095,0.94900000000000007,29,null,9.5000000000000107,36]
[null,null,null,0.95000000000000095,0.95000000000000007,29,null,9.5100000000000104,36]
[null,null,null,0.95100000000000096,0.95100000000000007,29,null,9.5200000000000102,36]
[null,null,null,0.95200000000000096,0.95200000000000007,29,null,9.53000000000001,36]
[null,null,null,0.95300000000000096,0.95300000000000007,29,null,9.5400000000000098,36]
[null,null,null,0.95400000000000096,0.95400000000000007,29,null,9.5500000000000096,36]
[null,null,null,0.95500000000000096,0.95500000000000007,29,null,9.5600000000000094,36]
[null,null,null,0.95600000000000096,0.95600000000000007,29,null,9.5700000000000092,36]
[null,null,null,0.95700000000000096,0.95700000000000007,29,null,9.5800000000000107,36]
[null,null,null,0.95800000000000096,0.95800000000000007,29,null,9.5900000000000105,36]
[null,null,null,0.95900000000000096,0.95900000000000007,29,null,9.6000000000000103,36]
[null,null,null,0.96000000000000096,0.96,29,null,9.6100000000000101,36]
[null,null,null,0.96100000000000096,{"$f":"FLOOR(D963,0.001)","v":0.96099999999999997},29,null,9.6200000000000099,36]
[null,null,null,0.96200000000000097,0.96199999999999997,29,null,9.6300000000000097,36]
[null,null,null,0.96300000000000097,0.96299999999999997,29,null,9.6400000000000095,36]
[null,null,null,0.96400000000000097,0.96399999999999997,29,null,9.6500000000000092,36]
[null,null,null,0.96500000000000097,0.96499999999999997,29,null,9.6600000000000108,36]
[null,null,null,0.96600000000000097,0.96599999999999997,29,null,9.6700000000000106,36]
[null,null,null,0.96700000000000097,0.96699999999999997,29,null,9.6800000000000104,36]
[null,null,null,0.96800000000000097,0.96799999999999997,29,null,9.6900000000000102,36]
[null,null,null,0.96900000000000097,0.96899999999999997,29,null,9.7000000000000099,36]
[null,null,null,0.97000000000000097,0.97,29,null,9.7100000000000097,36]
[null,null,null,0.97100000000000097,0.97099999999999997,29,null,9.7200000000000095,36]
[null,null,null,0.97200000000000097,0.97199999999999998,29,null,9.7300000000000093,36]
[null,null,null,0.97300000000000098,0.97299999999999998,29,null,9.7400000000000109,36]
[null,null,null,0.97400000000000098,0.97399999999999998,29,null,9.7500000000000107,36]
[null,null,null,0.97500000000000098,0.97499999999999998,29,null,9.7600000000000104,36]
[null,null,null,0.97600000000000098,0.97599999999999998,29,null,9.7700000000000102,36]
[null,null,null,0.97700000000000098,0.97699999999999998,29,null,9.78000000000001,36]
[null,null,null,0.97800000000000098,0.97799999999999998,29,null,9.7900000000000098,36]
[null,null,null,0.97900000000000098,0.97899999999999998,29,null,9.8000000000000096,36]
[null,null,null,0.98000000000000098,0.98,29,null,9.8100000000000094,36]
[null,null,null,0.98100000000000098,0.98099999999999998,29,null,9.8200000000000092,36]
[null,null,null,0.98200000000000098,0.98199999999999998,29,null,9.8300000000000107,36]
[null,null,null,0.98300000000000098,0.98299999999999998,29,null,9.8400000000000105,36]
[null,null,null,0.98400000000000098,0.98399999999999999,29,null,9.8500000000000103,36]
[null,null,null,0.98500000000000099,0.98499999999999999,29,null,9.8600000000000101,36]
[null,null,null,0.98600000000000099,0.98599999999999999,29,null,9.8700000000000099,36]
[null,null,null,0.98700000000000099,0.98699999999999999,29,null,9.8800000000000097,36]
[null,null,null,0.98800000000000099,0.98799999999999999,29,null,9.8900000000000095,36]
[null,null,null,0.98900000000000099,0.98899999999999999,29,null,9.9000000000000092,36]
[null,null,null,0.99000000000000099,0.99,29,null,9.9100000000000108,36]
[null,null,null,0.99100000000000099,0.99099999999999999,29]
[null,null,null,0.99200000000000099,0.99199999999999999,29]
[null,null,null,0.99300000000000099,0.99299999999999999,29]
[null,null,null,0.99400000000000099,0.99399999999999999,29]
[null,null,null,0.99500000000000099,0.995,29]
[null,null,null,0.996000000000001,0.996,29]
[null,null,null,0.997000000000001,0.997,29]
[null,null,null,0.998000000000001,0.998,29]
[null,null,null,0.999000000000001,0.999,29]
[null,null,null,1,1,29]

{"sheet":"EA Midrise","index":12,"n_rows":992,"n_cols":3,"rows_kept":992,"cut":false,"hidden":true,"merged":[]}
["Percentage reduction","Floor","Points"]
[0.01,{"$f":"FLOOR(A2,0.001)","v":0.01},0]
[1.0999999999999999E-2,{"$f":"FLOOR(A3,0.001)","v":1.0999999999999999E-2},0]
[1.2E-2,1.2E-2,0]
[1.2999999999999999E-2,1.3000000000000001E-2,0]
[1.4E-2,1.4E-2,0]
[1.4999999999999999E-2,1.4999999999999999E-2,0]
[1.6E-2,1.6E-2,0]
[1.7000000000000001E-2,1.7000000000000001E-2,0]
[1.7999999999999999E-2,1.8000000000000002E-2,0]
[1.9E-2,1.9E-2,0]
[0.02,0.02,0]
[2.1000000000000001E-2,2.1000000000000001E-2,0]
[2.1999999999999999E-2,2.1999999999999999E-2,0]
[2.3E-2,2.3E-2,0]
[2.4E-2,2.4E-2,0]
[2.5000000000000001E-2,2.5000000000000001E-2,0]
[2.5999999999999999E-2,2.6000000000000002E-2,0]
[2.7E-2,2.7E-2,0]
[2.8000000000000001E-2,2.8000000000000001E-2,0]
[2.9000000000000001E-2,2.9000000000000001E-2,0]
[0.03,0.03,0]
[3.1E-2,3.1E-2,0]
[3.2000000000000001E-2,3.2000000000000001E-2,0]
[3.3000000000000002E-2,3.3000000000000002E-2,0]
[3.4000000000000002E-2,3.4000000000000002E-2,0]
[3.5000000000000003E-2,3.5000000000000003E-2,0]
[3.5999999999999997E-2,3.6000000000000004E-2,0]
[3.6999999999999998E-2,3.6999999999999998E-2,0]
[3.7999999999999999E-2,3.7999999999999999E-2,0]
[3.9E-2,3.9E-2,0]
[0.04,0.04,0]
[4.1000000000000002E-2,4.1000000000000002E-2,0]
[4.2000000000000003E-2,4.2000000000000003E-2,0]
[4.2999999999999997E-2,4.3000000000000003E-2,0]
[4.3999999999999997E-2,4.3999999999999997E-2,0]
[4.4999999999999998E-2,4.4999999999999998E-2,0]
[4.5999999999999999E-2,4.5999999999999999E-2,0]
[4.7E-2,4.7E-2,0]
[4.8000000000000001E-2,4.8000000000000001E-2,0]
[4.9000000000000002E-2,4.9000000000000002E-2,0]
[0.05,0.05,0]
[5.0999999999999997E-2,5.1000000000000004E-2,0]
[5.1999999999999998E-2,5.2000000000000005E-2,0]
[5.2999999999999999E-2,5.2999999999999999E-2,0]
[5.3999999999999999E-2,5.3999999999999999E-2,0]
[5.5E-2,5.5E-2,0]
[5.6000000000000001E-2,5.6000000000000001E-2,0]
[5.7000000000000002E-2,5.7000000000000002E-2,0]
[5.8000000000000003E-2,5.8000000000000003E-2,0]
[5.8999999999999997E-2,5.9000000000000004E-2,0]
[0.06,0.06,1]
[6.0999999999999999E-2,6.0999999999999999E-2,1]
[6.2E-2,6.2E-2,1]
[6.3E-2,6.3E-2,1]
[6.4000000000000001E-2,6.4000000000000001E-2,1]
[6.5000000000000002E-2,6.5000000000000002E-2,1]
[6.6000000000000003E-2,6.6000000000000003E-2,1]
[6.7000000000000004E-2,6.7000000000000004E-2,1]
[6.8000000000000005E-2,6.8000000000000005E-2,1]
[6.9000000000000006E-2,6.9000000000000006E-2,1]
[7.0000000000000007E-2,7.0000000000000007E-2,1]
[7.0999999999999994E-2,7.1000000000000008E-2,2]
[7.1999999999999995E-2,7.2000000000000008E-2,2]
[7.2999999999999995E-2,7.2999999999999995E-2,2]
[7.3999999999999996E-2,7.3999999999999996E-2,2]
[7.4999999999999997E-2,{"$f":"FLOOR(A67,0.001)","v":7.4999999999999997E-2},2]
[7.5999999999999998E-2,7.5999999999999998E-2,2]
[7.6999999999999999E-2,7.6999999999999999E-2,2]
[7.8E-2,7.8E-2,2]
[7.9000000000000001E-2,7.9000000000000001E-2,2]
[0.08,0.08,2]
[8.1000000000000003E-2,8.1000000000000003E-2,3]
[8.2000000000000003E-2,8.2000000000000003E-2,3]
[8.3000000000000004E-2,8.3000000000000004E-2,3]
[8.4000000000000005E-2,8.4000000000000005E-2,3]
[8.5000000000000006E-2,8.5000000000000006E-2,3]
[8.5999999999999993E-2,8.6000000000000007E-2,3]
[8.6999999999999994E-2,8.7000000000000008E-2,3]
[8.7999999999999995E-2,8.7999999999999995E-2,3]
[8.8999999999999996E-2,8.8999999999999996E-2,3]
[0.09,0.09,3]
[9.0999999999999998E-2,9.0999999999999998E-2,4]
[9.1999999999999998E-2,9.1999999999999998E-2,4]
[9.2999999999999999E-2,9.2999999999999999E-2,4]
[9.4E-2,9.4E-2,4]
[9.5000000000000001E-2,9.5000000000000001E-2,4]
[9.6000000000000002E-2,9.6000000000000002E-2,4]
[9.7000000000000003E-2,9.7000000000000003E-2,4]
[9.8000000000000004E-2,9.8000000000000004E-2,4]
[9.9000000000000005E-2,9.9000000000000005E-2,4]
[0.1,0.1,4]
[0.10100000000000001,0.10100000000000001,5]
[0.10199999999999999,0.10200000000000001,5]
[0.10299999999999999,0.10300000000000001,5]
[0.104,0.10400000000000001,5]
[0.105,0.105,5]
[0.106,0.106,5]
[0.107,0.107,5]
[0.108,0.108,5]
[0.109,0.109,5]
[0.11,0.11,6]
[0.111,0.111,6]
[0.112,0.112,6]
[0.113,0.113,6]
[0.114,0.114,6]
[0.115,0.115,6]
[0.11600000000000001,0.11600000000000001,6]
[0.11700000000000001,0.11700000000000001,6]
[0.11799999999999999,0.11800000000000001,6]
[0.11899999999999999,0.11900000000000001,6]
[0.12,0.12,7]
[0.121,0.121,7]
[0.122,0.122,7]
[0.123,0.123,7]
[0.124,0.124,7]
[0.125,0.125,7]
[0.126,0.126,7]
[0.127,0.127,7]
[0.128,0.128,7]
[0.129,0.129,7]
[0.13,0.13,8]
[0.13100000000000001,0.13100000000000001,8]
[0.13200000000000001,0.13200000000000001,8]
[0.13300000000000001,0.13300000000000001,8]
[0.13400000000000001,0.13400000000000001,8]
[0.13500000000000001,0.13500000000000001,8]
[0.13600000000000001,0.13600000000000001,8]
[0.13700000000000001,0.13700000000000001,8]
[0.13800000000000001,0.13800000000000001,8]
[0.13900000000000001,{"$f":"FLOOR(A131,0.001)","v":0.13900000000000001},8]
[0.14000000000000001,0.14000000000000001,9]
[0.14099999999999999,0.14100000000000001,9]
[0.14199999999999999,0.14200000000000002,9]
[0.14299999999999999,0.14300000000000002,9]
[0.14399999999999999,0.14400000000000002,9]
[0.14499999999999999,0.14499999999999999,9]
[0.14599999999999999,0.14599999999999999,9]
[0.14699999999999999,0.14699999999999999,9]
[0.14799999999999999,0.14799999999999999,9]
[0.14899999999999999,0.14899999999999999,9]
[0.15,0.15,10]
[0.151,0.151,10]
[0.152,0.152,10]
[0.153,0.153,10]
[0.154,0.154,10]
[0.155,0.155,10]
[0.156,0.156,10]
[0.157,0.157,10]
[0.158,0.158,10]
[0.159,0.159,10]
[0.16,0.16,11]
[0.161,0.161,11]
[0.16200000000000001,0.16200000000000001,11]
[0.16300000000000001,0.16300000000000001,11]
[0.16400000000000001,0.16400000000000001,11]
[0.16500000000000001,0.16500000000000001,11]
[0.16600000000000001,0.16600000000000001,11]
[0.16700000000000001,0.16700000000000001,11]
[0.16800000000000001,0.16800000000000001,11]
[0.16900000000000001,0.16900000000000001,11]
[0.17,0.17,12]
[0.17100000000000001,0.17100000000000001,12]
[0.17199999999999999,0.17200000000000001,12]
[0.17299999999999999,0.17300000000000001,12]
[0.17399999999999999,0.17400000000000002,12]
[0.17499999999999999,0.17500000000000002,12]
[0.17599999999999999,0.17599999999999999,12]
[0.17699999999999999,0.17699999999999999,12]
[0.17799999999999999,0.17799999999999999,12]
[0.17899999999999999,0.17899999999999999,12]
[0.18,0.18,13]
[0.18099999999999999,0.18099999999999999,13]
[0.182,0.182,13]
[0.183,0.183,13]
[0.184,0.184,13]
[0.185,0.185,13]
[0.186,0.186,13]
[0.187,0.187,13]
[0.188,0.188,13]
[0.189,0.189,13]
[0.19,0.19,14]
[0.191,0.191,14]
[0.192,0.192,14]
[0.193,0.193,14]
[0.19400000000000001,0.19400000000000001,14]
[0.19500000000000001,0.19500000000000001,14]
[0.19600000000000001,0.19600000000000001,14]
[0.19700000000000001,0.19700000000000001,14]
[0.19800000000000001,0.19800000000000001,14]
[0.19900000000000001,0.19900000000000001,14]
[0.2,0.2,15]
[0.20100000000000001,0.20100000000000001,15]
[0.20200000000000001,0.20200000000000001,15]
[0.20300000000000001,{"$f":"FLOOR(A195,0.001)","v":0.20300000000000001},15]
[0.20399999999999999,0.20400000000000001,15]
[0.20499999999999999,0.20500000000000002,15]
[0.20599999999999999,0.20600000000000002,15]
[0.20699999999999999,0.20700000000000002,15]
[0.20799999999999999,0.20800000000000002,15]
[0.20899999999999999,0.20899999999999999,15]
[0.21,0.21,15]
[0.21099999999999999,0.21099999999999999,15]
[0.21199999999999999,0.21199999999999999,15]
[0.21299999999999999,0.21299999999999999,15]
[0.214,0.214,15]
[0.215,0.215,15]
[0.216,0.216,15]
[0.217,0.217,15]
[0.218,0.218,15]
[0.219,0.219,15]
[0.22,0.22,16]
[0.221,0.221,16]
[0.222,0.222,16]
[0.223,0.223,16]
[0.224,0.224,16]
[0.22500000000000001,0.22500000000000001,16]
[0.22600000000000001,0.22600000000000001,16]
[0.22700000000000001,0.22700000000000001,16]
[0.22800000000000001,0.22800000000000001,16]
[0.22900000000000001,0.22900000000000001,16]
[0.23,0.23,16]
[0.23100000000000001,0.23100000000000001,16]
[0.23200000000000001,0.23200000000000001,16]
[0.23300000000000001,0.23300000000000001,16]
[0.23400000000000001,0.23400000000000001,16]
[0.23499999999999999,0.23500000000000001,16]
[0.23599999999999999,0.23600000000000002,16]
[0.23699999999999999,0.23700000000000002,16]
[0.23799999999999999,0.23800000000000002,16]
[0.23899999999999999,0.23900000000000002,16]
[0.24,0.24,17]
[0.24099999999999999,0.24099999999999999,17]
[0.24199999999999999,0.24199999999999999,17]
[0.24299999999999999,0.24299999999999999,17]
[0.24399999999999999,0.24399999999999999,17]
[0.245,0.245,17]
[0.246,0.246,17]
[0.247,0.247,17]
[0.248,0.248,17]
[0.249,0.249,17]
[0.25,0.25,17]
[0.251,0.251,17]
[0.252,0.252,17]
[0.253,0.253,17]
[0.254,0.254,17]
[0.255,0.255,17]
[0.25600000000000001,0.25600000000000001,17]
[0.25700000000000001,0.25700000000000001,17]
[0.25800000000000001,0.25800000000000001,17]
[0.25900000000000001,0.25900000000000001,17]
[0.26,0.26,18]
[0.26100000000000001,0.26100000000000001,18]
[0.26200000000000001,0.26200000000000001,18]
[0.26300000000000001,0.26300000000000001,18]
[0.26400000000000001,0.26400000000000001,18]
[0.26500000000000001,0.26500000000000001,18]
[0.26600000000000001,0.26600000000000001,18]
[0.26700000000000002,{"$f":"FLOOR(A259,0.001)","v":0.26700000000000002},18]
[0.26800000000000002,0.26800000000000002,18]
[0.26900000000000002,0.26900000000000002,18]
[0.27,0.27,18]
[0.27100000000000002,0.27100000000000002,18]
[0.27200000000000002,0.27200000000000002,18]
[0.27300000000000002,0.27300000000000002,18]
[0.27400000000000002,0.27400000000000002,18]
[0.27500000000000002,0.27500000000000002,18]
[0.27600000000000002,0.27600000000000002,18]
[0.27700000000000002,0.27700000000000002,18]
[0.27800000000000002,0.27800000000000002,18]
[0.27900000000000003,0.27900000000000003,18]
[0.28000000000000003,0.28000000000000003,19]
[0.28100000000000003,0.28100000000000003,19]
[0.28199999999999997,0.28200000000000003,19]
[0.28299999999999997,0.28300000000000003,19]
[0.28399999999999997,0.28400000000000003,19]
[0.28499999999999998,0.28500000000000003,19]
[0.28599999999999998,0.28600000000000003,19]
[0.28699999999999998,0.28700000000000003,19]
[0.28799999999999998,0.28800000000000003,19]
[0.28899999999999998,0.28899999999999998,19]
[0.28999999999999998,0.28999999999999998,19]
[0.29099999999999998,0.29099999999999998,19]
[0.29199999999999998,0.29199999999999998,19]
[0.29299999999999998,0.29299999999999998,19]
[0.29399999999999998,0.29399999999999998,19]
[0.29499999999999998,0.29499999999999998,19]
[0.29599999999999999,0.29599999999999999,19]
[0.29699999999999999,0.29699999999999999,19]
[0.29799999999999999,0.29799999999999999,19]
[0.29899999999999999,0.29899999999999999,19]
[0.3,0.3,20]
[0.30099999999999999,0.30099999999999999,20]
[0.30199999999999999,0.30199999999999999,20]
[0.30299999999999999,0.30299999999999999,20]
[0.30399999999999999,0.30399999999999999,20]
[0.30499999999999999,0.30499999999999999,20]
[0.30599999999999999,0.30599999999999999,20]
[0.307,0.307,20]
[0.308,0.308,20]
[0.309,0.309,20]
[0.31,0.31,20]
[0.311,0.311,20]
[0.312,0.312,20]
[0.313,0.313,20]
[0.314,0.314,20]
[0.315,0.315,20]
[0.316,0.316,20]
[0.317,0.317,20]
[0.318,0.318,20]
[0.31900000000000001,0.31900000000000001,20]
[0.32,0.32,20]
[0.32100000000000001,0.32100000000000001,20]
[0.32200000000000001,0.32200000000000001,20]
[0.32300000000000001,0.32300000000000001,20]
[0.32400000000000001,0.32400000000000001,20]
[0.32500000000000001,0.32500000000000001,20]
[0.32600000000000001,0.32600000000000001,20]
[0.32700000000000001,0.32700000000000001,20]
[0.32800000000000001,0.32800000000000001,20]
[0.32900000000000001,0.32900000000000001,20]
[0.33,0.33,21]
[0.33100000000000002,{"$f":"FLOOR(A323,0.001)","v":0.33100000000000002},21]
[0.33200000000000002,0.33200000000000002,21]
[0.33300000000000002,0.33300000000000002,21]
[0.33400000000000002,0.33400000000000002,21]
[0.33500000000000002,0.33500000000000002,21]
[0.33600000000000002,0.33600000000000002,21]
[0.33700000000000002,0.33700000000000002,21]
[0.33800000000000002,0.33800000000000002,21]
[0.33900000000000002,0.33900000000000002,21]
[0.34,0.34,21]
[0.34100000000000003,0.34100000000000003,21]
[0.34200000000000003,0.34200000000000003,21]
[0.34300000000000003,0.34300000000000003,21]
[0.34399999999999997,0.34400000000000003,21]
[0.34499999999999997,0.34500000000000003,21]
[0.34599999999999997,0.34600000000000003,21]
[0.34699999999999998,0.34700000000000003,21]
[0.34799999999999998,0.34800000000000003,21]
[0.34899999999999998,0.34900000000000003,21]
[0.35,0.35000000000000003,21]
[0.35099999999999998,0.35100000000000003,21]
[0.35199999999999998,0.35199999999999998,21]
[0.35299999999999998,0.35299999999999998,21]
[0.35399999999999998,0.35399999999999998,21]
[0.35499999999999998,0.35499999999999998,21]
[0.35599999999999998,0.35599999999999998,21]
[0.35699999999999998,0.35699999999999998,21]
[0.35799999999999998,0.35799999999999998,21]
[0.35899999999999999,0.35899999999999999,21]
[0.36,0.36,22]
[0.36099999999999999,0.36099999999999999,22]
[0.36199999999999999,0.36199999999999999,22]
[0.36299999999999999,0.36299999999999999,22]
[0.36399999999999999,0.36399999999999999,22]
[0.36499999999999999,0.36499999999999999,22]
[0.36599999999999999,0.36599999999999999,22]
[0.36699999999999999,0.36699999999999999,22]
[0.36799999999999999,0.36799999999999999,22]
[0.36899999999999999,0.36899999999999999,22]
[0.37,0.37,22]
[0.371,0.371,22]
[0.372,0.372,22]
[0.373,0.373,22]
[0.374,0.374,22]
[0.375,0.375,22]
[0.376,0.376,22]
[0.377,0.377,22]
[0.378,0.378,22]
[0.379,0.379,22]
[0.38,0.38,22]
[0.38100000000000001,0.38100000000000001,22]
[0.38200000000000001,0.38200000000000001,22]
[0.38300000000000001,0.38300000000000001,22]
[0.38400000000000001,0.38400000000000001,22]
[0.38500000000000001,0.38500000000000001,22]
[0.38600000000000001,0.38600000000000001,22]
[0.38700000000000001,0.38700000000000001,22]
[0.38800000000000001,0.38800000000000001,22]
[0.38900000000000001,0.38900000000000001,22]
[0.39,0.39,23]
[0.39100000000000001,0.39100000000000001,23]
[0.39200000000000002,0.39200000000000002,23]
[0.39300000000000002,0.39300000000000002,23]
[0.39400000000000002,0.39400000000000002,23]
[0.39500000000000002,{"$f":"FLOOR(A387,0.001)","v":0.39500000000000002},23]
[0.39600000000000002,0.39600000000000002,23]
[0.39700000000000002,0.39700000000000002,23]
[0.39800000000000002,0.39800000000000002,23]
[0.39900000000000002,0.39900000000000002,23]
[0.4,0.4,23]
[0.40100000000000002,0.40100000000000002,23]
[0.40200000000000002,0.40200000000000002,23]
[0.40300000000000002,0.40300000000000002,23]
[0.40400000000000003,0.40400000000000003,23]
[0.40500000000000003,0.40500000000000003,23]
[0.40600000000000003,0.40600000000000003,23]
[0.40699999999999997,0.40700000000000003,23]
[0.40799999999999997,0.40800000000000003,23]
[0.40899999999999997,0.40900000000000003,23]
[0.41,0.41000000000000003,23]
[0.41099999999999998,0.41100000000000003,23]
[0.41199999999999998,0.41200000000000003,23]
[0.41299999999999998,0.41300000000000003,23]
[0.41399999999999998,0.41400000000000003,23]
[0.41499999999999998,0.41500000000000004,23]
[0.41599999999999998,0.41600000000000004,23]
[0.41699999999999998,0.41699999999999998,23]
[0.41799999999999998,0.41799999999999998,23]
[0.41899999999999998,0.41899999999999998,23]
[0.42,0.42,24]
[0.42099999999999999,0.42099999999999999,24]
[0.42199999999999999,0.42199999999999999,24]
[0.42299999999999999,0.42299999999999999,24]
[0.42399999999999999,0.42399999999999999,24]
[0.42499999999999999,0.42499999999999999,24]
[0.42599999999999999,0.42599999999999999,24]
[0.42699999999999999,0.42699999999999999,24]
[0.42799999999999999,0.42799999999999999,24]
[0.42899999999999999,0.42899999999999999,24]
[0.43,0.43,24]
[0.43099999999999999,0.43099999999999999,24]
[0.432,0.432,24]
[0.433,0.433,24]
[0.434,0.434,24]
[0.435,0.435,24]
[0.436,0.436,24]
[0.437,0.437,24]
[0.438,0.438,24]
[0.439,0.439,24]
[0.44,0.44,24]
[0.441,0.441,24]
[0.442,0.442,24]
[0.443,0.443,24]
[0.44400000000000001,0.44400000000000001,24]
[0.44500000000000001,0.44500000000000001,24]
[0.44600000000000001,0.44600000000000001,24]
[0.44700000000000001,0.44700000000000001,24]
[0.44800000000000001,0.44800000000000001,24]
[0.44900000000000001,0.44900000000000001,24]
[0.45,0.45,25]
[0.45100000000000001,0.45100000000000001,25]
[0.45200000000000001,0.45200000000000001,25]
[0.45300000000000001,0.45300000000000001,25]
[0.45400000000000001,0.45400000000000001,25]
[0.45500000000000002,0.45500000000000002,25]
[0.45600000000000002,0.45600000000000002,25]
[0.45700000000000002,0.45700000000000002,25]
[0.45800000000000002,0.45800000000000002,25]
[0.45900000000000002,{"$f":"FLOOR(A451,0.001)","v":0.45900000000000002},25]
[0.46,0.46,25]
[0.46100000000000002,0.46100000000000002,25]
[0.46200000000000002,0.46200000000000002,25]
[0.46300000000000002,0.46300000000000002,25]
[0.46400000000000002,0.46400000000000002,25]
[0.46500000000000002,0.46500000000000002,25]
[0.46600000000000003,0.46600000000000003,25]
[0.46700000000000003,0.46700000000000003,25]
[0.46800000000000003,0.46800000000000003,25]
[0.46899999999999997,0.46900000000000003,25]
[0.47,0.47000000000000003,25]
[0.47099999999999997,0.47100000000000003,25]
[0.47199999999999998,0.47200000000000003,25]
[0.47299999999999998,0.47300000000000003,25]
[0.47399999999999998,0.47400000000000003,25]
[0.47499999999999998,0.47500000000000003,25]
[0.47599999999999998,0.47600000000000003,25]
[0.47699999999999998,0.47700000000000004,25]
[0.47799999999999998,0.47800000000000004,25]
[0.47899999999999998,0.47900000000000004,25]
[0.48,0.48,26]
[0.48099999999999998,0.48099999999999998,26]
[0.48199999999999998,0.48199999999999998,26]
[0.48299999999999998,0.48299999999999998,26]
[0.48399999999999999,0.48399999999999999,26]
[0.48499999999999999,0.48499999999999999,26]
[0.48599999999999999,0.48599999999999999,26]
[0.48699999999999999,0.48699999999999999,26]
[0.48799999999999999,0.48799999999999999,26]
[0.48899999999999999,0.48899999999999999,26]
[0.49,0.49,26]
[0.49099999999999999,0.49099999999999999,26]
[0.49199999999999999,0.49199999999999999,26]
[0.49299999999999999,0.49299999999999999,26]
[0.49399999999999999,0.49399999999999999,26]
[0.495,0.495,26]
[0.496,0.496,26]
[0.497,0.497,26]
[0.498,0.498,26]
[0.499,0.499,26]
[0.5,0.5,26]
[0.501,0.501,26]
[0.502,0.502,26]
[0.503,0.503,26]
[0.504,0.504,26]
[0.505,0.505,26]
[0.50600000000000001,0.50600000000000001,26]
[0.50700000000000001,0.50700000000000001,26]
[0.50800000000000001,0.50800000000000001,26]
[0.50900000000000001,0.50900000000000001,26]
[0.51,0.51,27]
[0.51100000000000001,0.51100000000000001,27]
[0.51200000000000001,0.51200000000000001,27]
[0.51300000000000001,0.51300000000000001,27]
[0.51400000000000001,0.51400000000000001,27]
[0.51500000000000001,0.51500000000000001,27]
[0.51600000000000001,0.51600000000000001,27]
[0.51700000000000002,0.51700000000000002,27]
[0.51800000000000002,0.51800000000000002,27]
[0.51900000000000002,0.51900000000000002,27]
[0.52,0.52,27]
[0.52100000000000002,0.52100000000000002,27]
[0.52200000000000002,0.52200000000000002,27]
[0.52300000000000002,{"$f":"FLOOR(A515,0.001)","v":0.52300000000000002},27]
[0.52400000000000002,0.52400000000000002,27]
[0.52500000000000002,0.52500000000000002,27]
[0.52600000000000002,0.52600000000000002,27]
[0.52700000000000002,0.52700000000000002,27]
[0.52800000000000002,0.52800000000000002,27]
[0.52900000000000003,0.52900000000000003,27]
[0.53,0.53,27]
[0.53100000000000003,0.53100000000000003,27]
[0.53200000000000003,0.53200000000000003,27]
[0.53300000000000003,0.53300000000000003,27]
[0.53400000000000003,0.53400000000000003,27]
[0.53500000000000003,0.53500000000000003,27]
[0.53600000000000003,0.53600000000000003,27]
[0.53700000000000003,0.53700000000000003,27]
[0.53800000000000003,0.53800000000000003,27]
[0.53900000000000003,0.53900000000000003,27]
[0.54,0.54,28]
[0.54100000000000004,0.54100000000000004,28]
[0.54200000000000004,0.54200000000000004,28]
[0.54300000000000004,0.54300000000000004,28]
[0.54400000000000004,0.54400000000000004,28]
[0.54500000000000004,0.54500000000000004,28]
[0.54600000000000004,0.54600000000000004,28]
[0.54700000000000004,0.54700000000000004,28]
[0.54800000000000004,0.54800000000000004,28]
[0.54900000000000004,0.54900000000000004,28]
[0.55000000000000004,0.55000000000000004,28]
[0.55100000000000005,0.55100000000000005,28]
[0.55200000000000005,0.55200000000000005,28]
[0.55300000000000005,0.55300000000000005,28]
[0.55400000000000005,0.55400000000000005,28]
[0.55500000000000005,0.55500000000000005,28]
[0.55600000000000005,0.55600000000000005,28]
[0.55700000000000005,0.55700000000000005,28]
[0.55800000000000005,0.55800000000000005,28]
[0.55900000000000005,0.55900000000000005,28]
[0.56000000000000005,0.56000000000000005,28]
[0.56100000000000005,0.56100000000000005,28]
[0.56200000000000006,0.56200000000000006,28]
[0.56299999999999994,0.56300000000000006,28]
[0.56399999999999995,0.56400000000000006,28]
[0.56499999999999995,0.56500000000000006,28]
[0.56599999999999995,0.56600000000000006,28]
[0.56699999999999995,0.56700000000000006,28]
[0.56799999999999995,0.56800000000000006,28]
[0.56899999999999995,0.56900000000000006,28]
[0.56999999999999995,0.57000000000000006,28]
[0.57099999999999995,0.57100000000000006,29]
[0.57199999999999995,0.57200000000000006,29]
[0.57299999999999995,0.57300000000000006,29]
[0.57399999999999995,0.57400000000000007,29]
[0.57499999999999996,0.57500000000000007,29]
[0.57599999999999996,0.57600000000000007,29]
[0.57699999999999996,0.57699999999999996,29]
[0.57799999999999996,0.57799999999999996,29]
[0.57899999999999996,0.57899999999999996,29]
[0.57999999999999996,0.57999999999999996,29]
[0.58099999999999996,0.58099999999999996,29]
[0.58199999999999996,0.58199999999999996,29]
[0.58299999999999996,0.58299999999999996,29]
[0.58399999999999996,0.58399999999999996,29]
[0.58499999999999996,0.58499999999999996,29]
[0.58599999999999997,0.58599999999999997,29]
[0.58699999999999997,{"$f":"FLOOR(A579,0.001)","v":0.58699999999999997},29]
[0.58799999999999997,0.58799999999999997,29]
[0.58899999999999997,0.58899999999999997,29]
[0.59,0.59,29]
[0.59099999999999997,0.59099999999999997,29]
[0.59199999999999997,0.59199999999999997,29]
[0.59299999999999997,0.59299999999999997,29]
[0.59399999999999997,0.59399999999999997,29]
[0.59499999999999997,0.59499999999999997,29]
[0.59599999999999997,0.59599999999999997,29]
[0.59699999999999998,0.59699999999999998,29]
[0.59799999999999998,0.59799999999999998,29]
[0.59899999999999998,0.59899999999999998,29]
[0.6,0.6,30]
[0.60099999999999998,0.60099999999999998,30]
[0.60199999999999998,0.60199999999999998,30]
[0.60299999999999998,0.60299999999999998,30]
[0.60399999999999998,0.60399999999999998,30]
[0.60499999999999998,0.60499999999999998,30]
[0.60599999999999998,0.60599999999999998,30]
[0.60699999999999998,0.60699999999999998,30]
[0.60799999999999998,0.60799999999999998,30]
[0.60899999999999999,0.60899999999999999,30]
[0.61,0.61,30]
[0.61099999999999999,0.61099999999999999,30]
[0.61199999999999999,0.61199999999999999,30]
[0.61299999999999999,0.61299999999999999,30]
[0.61399999999999999,0.61399999999999999,30]
[0.61499999999999999,0.61499999999999999,30]
[0.61599999999999999,0.61599999999999999,30]
[0.61699999999999999,0.61699999999999999,30]
[0.61799999999999999,0.61799999999999999,30]
[0.61899999999999999,0.61899999999999999,30]
[0.62,0.62,30]
[0.621,0.621,30]
[0.622,0.622,30]
[0.623,0.623,30]
[0.624,0.624,30]
[0.625,0.625,30]
[0.626,0.626,30]
[0.627,0.627,30]
[0.628,0.628,30]
[0.629,0.629,30]
[0.63,0.63,30]
[0.63100000000000001,0.63100000000000001,30]
[0.63200000000000001,0.63200000000000001,30]
[0.63300000000000001,0.63300000000000001,30]
[0.63400000000000001,0.63400000000000001,30]
[0.63500000000000001,0.63500000000000001,30]
[0.63600000000000001,0.63600000000000001,30]
[0.63700000000000001,0.63700000000000001,30]
[0.63800000000000001,0.63800000000000001,30]
[0.63900000000000001,0.63900000000000001,30]
[0.64,0.64,30]
[0.64100000000000001,0.64100000000000001,30]
[0.64200000000000002,0.64200000000000002,30]
[0.64300000000000002,0.64300000000000002,30]
[0.64400000000000002,0.64400000000000002,30]
[0.64500000000000002,0.64500000000000002,30]
[0.64600000000000002,0.64600000000000002,30]
[0.64700000000000002,0.64700000000000002,30]
[0.64800000000000002,0.64800000000000002,30]
[0.64900000000000002,0.64900000000000002,30]
[0.65,0.65,30]
[0.65100000000000002,{"$f":"FLOOR(A643,0.001)","v":0.65100000000000002},30]
[0.65200000000000002,0.65200000000000002,30]
[0.65300000000000002,0.65300000000000002,30]
[0.65400000000000003,0.65400000000000003,30]
[0.65500000000000003,0.65500000000000003,30]
[0.65600000000000003,0.65600000000000003,30]
[0.65700000000000003,0.65700000000000003,30]
[0.65800000000000003,0.65800000000000003,30]
[0.65900000000000003,0.65900000000000003,30]
[0.66,0.66,30]
[0.66100000000000003,0.66100000000000003,30]
[0.66200000000000003,0.66200000000000003,30]
[0.66300000000000003,0.66300000000000003,30]
[0.66400000000000003,0.66400000000000003,30]
[0.66500000000000004,0.66500000000000004,30]
[0.66600000000000004,0.66600000000000004,30]
[0.66700000000000004,0.66700000000000004,30]
[0.66800000000000004,0.66800000000000004,30]
[0.66900000000000004,0.66900000000000004,30]
[0.67,0.67,30]
[0.67100000000000004,0.67100000000000004,30]
[0.67200000000000004,0.67200000000000004,30]
[0.67300000000000004,0.67300000000000004,30]
[0.67400000000000004,0.67400000000000004,30]
[0.67500000000000004,0.67500000000000004,30]
[0.67600000000000005,0.67600000000000005,30]
[0.67700000000000005,0.67700000000000005,30]
[0.67800000000000005,0.67800000000000005,30]
[0.67900000000000005,0.67900000000000005,30]
[0.68,0.68,30]
[0.68100000000000005,0.68100000000000005,30]
[0.68200000000000005,0.68200000000000005,30]
[0.68300000000000005,0.68300000000000005,30]
[0.68400000000000005,0.68400000000000005,30]
[0.68500000000000005,0.68500000000000005,30]
[0.68600000000000005,0.68600000000000005,30]
[0.68700000000000006,0.68700000000000006,30]
[0.68799999999999994,0.68800000000000006,30]
[0.68899999999999995,0.68900000000000006,30]
[0.69,0.69000000000000006,30]
[0.69099999999999995,0.69100000000000006,30]
[0.69199999999999995,0.69200000000000006,30]
[0.69299999999999995,0.69300000000000006,30]
[0.69399999999999995,0.69400000000000006,30]
[0.69499999999999995,0.69500000000000006,30]
[0.69599999999999995,0.69600000000000006,30]
[0.69699999999999995,0.69700000000000006,30]
[0.69799999999999995,0.69800000000000006,30]
[0.69899999999999995,0.69900000000000007,30]
[0.7,0.70000000000000007,30]
[0.70099999999999996,0.70100000000000007,30]
[0.70199999999999996,0.70200000000000007,30]
[0.70299999999999996,0.70300000000000007,30]
[0.70399999999999996,0.70399999999999996,30]
[0.70499999999999996,0.70499999999999996,30]
[0.70599999999999996,0.70599999999999996,30]
[0.70699999999999996,0.70699999999999996,30]
[0.70799999999999996,0.70799999999999996,30]
[0.70899999999999996,0.70899999999999996,30]
[0.71,0.71,30]
[0.71099999999999997,0.71099999999999997,30]
[0.71199999999999997,0.71199999999999997,30]
[0.71299999999999997,0.71299999999999997,30]
[0.71399999999999997,0.71399999999999997,30]
[0.71499999999999997,{"$f":"FLOOR(A707,0.001)","v":0.71499999999999997},30]
[0.71599999999999997,0.71599999999999997,30]
[0.71699999999999997,0.71699999999999997,30]
[0.71799999999999997,0.71799999999999997,30]
[0.71899999999999997,0.71899999999999997,30]
[0.72,0.72,30]
[0.72099999999999997,0.72099999999999997,30]
[0.72199999999999998,0.72199999999999998,30]
[0.72299999999999998,0.72299999999999998,30]
[0.72399999999999998,0.72399999999999998,30]
[0.72499999999999998,0.72499999999999998,30]
[0.72599999999999998,0.72599999999999998,30]
[0.72699999999999998,0.72699999999999998,30]
[0.72799999999999998,0.72799999999999998,30]
[0.72899999999999998,0.72899999999999998,30]
[0.73,0.73,30]
[0.73099999999999998,0.73099999999999998,30]
[0.73199999999999998,0.73199999999999998,30]
[0.73299999999999998,0.73299999999999998,30]
[0.73399999999999999,0.73399999999999999,30]
[0.73499999999999999,0.73499999999999999,30]
[0.73599999999999999,0.73599999999999999,30]
[0.73699999999999999,0.73699999999999999,30]
[0.73799999999999999,0.73799999999999999,30]
[0.73899999999999999,0.73899999999999999,30]
[0.74,0.74,30]
[0.74099999999999999,0.74099999999999999,30]
[0.74199999999999999,0.74199999999999999,30]
[0.74299999999999999,0.74299999999999999,30]
[0.74399999999999999,0.74399999999999999,30]
[0.745,0.745,30]
[0.746,0.746,30]
[0.747,0.747,30]
[0.748,0.748,30]
[0.749,0.749,30]
[0.75,0.75,30]
[0.751,0.751,30]
[0.752,0.752,30]
[0.753,0.753,30]
[0.754,0.754,30]
[0.755,0.755,30]
[0.75600000000000001,0.75600000000000001,30]
[0.75700000000000001,0.75700000000000001,30]
[0.75800000000000001,0.75800000000000001,30]
[0.75900000000000001,0.75900000000000001,30]
[0.76,0.76,30]
[0.76100000000000001,0.76100000000000001,30]
[0.76200000000000001,0.76200000000000001,30]
[0.76300000000000001,0.76300000000000001,30]
[0.76400000000000001,0.76400000000000001,30]
[0.76500000000000001,0.76500000000000001,30]
[0.76600000000000001,0.76600000000000001,30]
[0.76700000000000002,0.76700000000000002,30]
[0.76800000000000002,0.76800000000000002,30]
[0.76900000000000002,0.76900000000000002,30]
[0.77,0.77,30]
[0.77100000000000002,0.77100000000000002,30]
[0.77200000000000002,0.77200000000000002,30]
[0.77300000000000002,0.77300000000000002,30]
[0.77400000000000002,0.77400000000000002,30]
[0.77500000000000002,0.77500000000000002,30]
[0.77600000000000002,0.77600000000000002,30]
[0.77700000000000002,0.77700000000000002,30]
[0.77800000000000002,0.77800000000000002,30]
[0.77900000000000003,{"$f":"FLOOR(A771,0.001)","v":0.77900000000000003},30]
[0.78,0.78,30]
[0.78100000000000003,0.78100000000000003,30]
[0.78200000000000003,0.78200000000000003,30]
[0.78300000000000003,0.78300000000000003,30]
[0.78400000000000003,0.78400000000000003,30]
[0.78500000000000003,0.78500000000000003,30]
[0.78600000000000003,0.78600000000000003,30]
[0.78700000000000003,0.78700000000000003,30]
[0.78800000000000003,0.78800000000000003,30]
[0.78900000000000003,0.78900000000000003,30]
[0.79,0.79,30]
[0.79100000000000004,0.79100000000000004,30]
[0.79200000000000004,0.79200000000000004,30]
[0.79300000000000004,0.79300000000000004,30]
[0.79400000000000004,0.79400000000000004,30]
[0.79500000000000004,0.79500000000000004,30]
[0.79600000000000004,0.79600000000000004,30]
[0.79700000000000004,0.79700000000000004,30]
[0.79800000000000004,0.79800000000000004,30]
[0.79900000000000004,0.79900000000000004,30]
[0.8,0.8,30]
[0.80100000000000005,0.80100000000000005,30]
[0.80200000000000005,0.80200000000000005,30]
[0.80300000000000005,0.80300000000000005,30]
[0.80400000000000005,0.80400000000000005,30]
[0.80500000000000005,0.80500000000000005,30]
[0.80600000000000005,0.80600000000000005,30]
[0.80700000000000005,0.80700000000000005,30]
[0.80800000000000005,0.80800000000000005,30]
[0.80900000000000005,0.80900000000000005,30]
[0.81,0.81,30]
[0.81100000000000005,0.81100000000000005,30]
[0.81200000000000006,0.81200000000000006,30]
[0.81299999999999994,0.81300000000000006,30]
[0.81399999999999995,0.81400000000000006,30]
[0.81499999999999995,0.81500000000000006,30]
[0.81599999999999995,0.81600000000000006,30]
[0.81699999999999995,0.81700000000000006,30]
[0.81799999999999995,0.81800000000000006,30]
[0.81899999999999995,0.81900000000000006,30]
[0.82,0.82000000000000006,30]
[0.82099999999999995,0.82100000000000006,30]
[0.82199999999999995,0.82200000000000006,30]
[0.82299999999999995,0.82300000000000006,30]
[0.82399999999999995,0.82400000000000007,30]
[0.82499999999999996,0.82500000000000007,30]
[0.82599999999999996,0.82600000000000007,30]
[0.82699999999999996,0.82700000000000007,30]
[0.82799999999999996,0.82800000000000007,30]
[0.82899999999999996,0.82900000000000007,30]
[0.83,0.83000000000000007,30]
[0.83099999999999996,0.83100000000000007,30]
[0.83199999999999996,0.83200000000000007,30]
[0.83299999999999996,0.83299999999999996,30]
[0.83399999999999996,0.83399999999999996,30]
[0.83499999999999996,0.83499999999999996,30]
[0.83599999999999997,0.83599999999999997,30]
[0.83699999999999997,0.83699999999999997,30]
[0.83799999999999997,0.83799999999999997,30]
[0.83899999999999997,0.83899999999999997,30]
[0.84,0.84,30]
[0.84099999999999997,0.84099999999999997,30]
[0.84199999999999997,0.84199999999999997,30]
[0.84299999999999997,{"$f":"FLOOR(A835,0.001)","v":0.84299999999999997},30]
[0.84399999999999997,0.84399999999999997,30]
[0.84499999999999997,0.84499999999999997,30]
[0.84599999999999997,0.84599999999999997,30]
[0.84699999999999998,0.84699999999999998,30]
[0.84799999999999998,0.84799999999999998,30]
[0.84899999999999998,0.84899999999999998,30]
[0.85,0.85,30]
[0.85099999999999998,0.85099999999999998,30]
[0.85199999999999998,0.85199999999999998,30]
[0.85299999999999998,0.85299999999999998,30]
[0.85399999999999998,0.85399999999999998,30]
[0.85499999999999998,0.85499999999999998,30]
[0.85599999999999998,0.85599999999999998,30]
[0.85699999999999998,0.85699999999999998,30]
[0.85799999999999998,0.85799999999999998,30]
[0.85899999999999999,0.85899999999999999,30]
[0.86,0.86,30]
[0.86099999999999999,0.86099999999999999,30]
[0.86199999999999999,0.86199999999999999,30]
[0.86299999999999999,0.86299999999999999,30]
[0.86399999999999999,0.86399999999999999,30]
[0.86499999999999999,0.86499999999999999,30]
[0.86599999999999999,0.86599999999999999,30]
[0.86699999999999999,0.86699999999999999,30]
[0.86799999999999999,0.86799999999999999,30]
[0.86899999999999999,0.86899999999999999,30]
[0.87,0.87,30]
[0.871,0.871,30]
[0.872,0.872,30]
[0.873,0.873,30]
[0.874,0.874,30]
[0.875,0.875,30]
[0.876,0.876,30]
[0.877,0.877,30]
[0.878,0.878,30]
[0.879,0.879,30]
[0.88,0.88,30]
[0.88100000000000001,0.88100000000000001,30]
[0.88200000000000001,0.88200000000000001,30]
[0.88300000000000001,0.88300000000000001,30]
[0.88400000000000001,0.88400000000000001,30]
[0.88500000000000001,0.88500000000000001,30]
[0.88600000000000001,0.88600000000000001,30]
[0.88700000000000001,0.88700000000000001,30]
[0.88800000000000001,0.88800000000000001,30]
[0.88900000000000001,0.88900000000000001,30]
[0.89,0.89,30]
[0.89100000000000001,0.89100000000000001,30]
[0.89200000000000002,0.89200000000000002,30]
[0.89300000000000002,0.89300000000000002,30]
[0.89400000000000002,0.89400000000000002,30]
[0.89500000000000002,0.89500000000000002,30]
[0.89600000000000002,0.89600000000000002,30]
[0.89700000000000002,0.89700000000000002,30]
[0.89800000000000002,0.89800000000000002,30]
[0.89900000000000002,0.89900000000000002,30]
[0.9,0.9,30]
[0.90100000000000002,0.90100000000000002,30]
[0.90200000000000002,0.90200000000000002,30]
[0.90300000000000002,0.90300000000000002,30]
[0.90400000000000003,0.90400000000000003,30]
[0.90500000000000003,0.90500000000000003,30]
[0.90600000000000003,0.90600000000000003,30]
[0.90700000000000003,{"$f":"FLOOR(A899,0.001)","v":0.90700000000000003},30]
[0.90800000000000003,0.90800000000000003,30]
[0.90900000000000003,0.90900000000000003,30]
[0.91,0.91,30]
[0.91100000000000003,0.91100000000000003,30]
[0.91200000000000003,0.91200000000000003,30]
[0.91300000000000003,0.91300000000000003,30]
[0.91400000000000003,0.91400000000000003,30]
[0.91500000000000004,0.91500000000000004,30]
[0.91600000000000004,0.91600000000000004,30]
[0.91700000000000004,0.91700000000000004,30]
[0.91800000000000004,0.91800000000000004,30]
[0.91900000000000004,0.91900000000000004,30]
[0.92,0.92,30]
[0.92100000000000004,0.92100000000000004,30]
[0.92200000000000004,0.92200000000000004,30]
[0.92300000000000004,0.92300000000000004,30]
[0.92400000000000004,0.92400000000000004,30]
[0.92500000000000004,0.92500000000000004,30]
[0.92600000000000005,0.92600000000000005,30]
[0.92700000000000005,0.92700000000000005,30]
[0.92800000000000005,0.92800000000000005,30]
[0.92900000000000005,0.92900000000000005,30]
[0.93,0.93,30]
[0.93100000000000005,0.93100000000000005,30]
[0.93200000000000005,0.93200000000000005,30]
[0.93300000000000005,0.93300000000000005,30]
[0.93400000000000005,0.93400000000000005,30]
[0.93500000000000005,0.93500000000000005,30]
[0.93600000000000005,0.93600000000000005,30]
[0.93700000000000006,0.93700000000000006,30]
[0.93799999999999994,0.93800000000000006,30]
[0.93899999999999995,0.93900000000000006,30]
[0.94,0.94000000000000006,30]
[0.94099999999999995,0.94100000000000006,30]
[0.94199999999999995,0.94200000000000006,30]
[0.94299999999999995,0.94300000000000006,30]
[0.94399999999999995,0.94400000000000006,30]
[0.94499999999999995,0.94500000000000006,30]
[0.94599999999999995,0.94600000000000006,30]
[0.94699999999999995,0.94700000000000006,30]
[0.94799999999999995,0.94800000000000006,30]
[0.94899999999999995,0.94900000000000007,30]
[0.95,0.95000000000000007,30]
[0.95099999999999996,0.95100000000000007,30]
[0.95199999999999996,0.95200000000000007,30]
[0.95299999999999996,0.95300000000000007,30]
[0.95399999999999996,0.95400000000000007,30]
[0.95499999999999996,0.95500000000000007,30]
[0.95599999999999996,0.95600000000000007,30]
[0.95699999999999996,0.95700000000000007,30]
[0.95799999999999996,0.95800000000000007,30]
[0.95899999999999996,0.95900000000000007,30]
[0.96,0.96,30]
[0.96099999999999997,0.96099999999999997,30]
[0.96199999999999997,0.96199999999999997,30]
[0.96299999999999997,0.96299999999999997,30]
[0.96399999999999997,0.96399999999999997,30]
[0.96499999999999997,0.96499999999999997,30]
[0.96599999999999997,0.96599999999999997,30]
[0.96699999999999997,0.96699999999999997,30]
[0.96799999999999997,0.96799999999999997,30]
[0.96899999999999997,0.96899999999999997,30]
[0.97,0.97,30]
[0.97099999999999997,{"$f":"FLOOR(A963,0.001)","v":0.97099999999999997},30]
[0.97199999999999998,0.97199999999999998,30]
[0.97299999999999998,0.97299999999999998,30]
[0.97399999999999998,0.97399999999999998,30]
[0.97499999999999998,0.97499999999999998,30]
[0.97599999999999998,0.97599999999999998,30]
[0.97699999999999998,0.97699999999999998,30]
[0.97799999999999998,0.97799999999999998,30]
[0.97899999999999998,0.97899999999999998,30]
[0.98,0.98,30]
[0.98099999999999998,0.98099999999999998,30]
[0.98199999999999998,0.98199999999999998,30]
[0.98299999999999998,0.98299999999999998,30]
[0.98399999999999999,0.98399999999999999,30]
[0.98499999999999999,0.98499999999999999,30]
[0.98599999999999999,0.98599999999999999,30]
[0.98699999999999999,0.98699999999999999,30]
[0.98799999999999999,0.98799999999999999,30]
[0.98899999999999999,0.98899999999999999,30]
[0.99,0.99,30]
[0.99099999999999999,0.99099999999999999,30]
[0.99199999999999999,0.99199999999999999,30]
[0.99299999999999999,0.99299999999999999,30]
[0.99399999999999999,0.99399999999999999,30]
[0.995,0.995,30]
[0.996,0.996,30]
[0.997,0.997,30]
[0.998,0.998,30]
[0.999,0.999,30]
[1,1,30]

{"sheet":"MR","index":13,"n_rows":170,"n_cols":17,"rows_kept":170,"cut":false,"hidden":false,"merged":[[90,3,90,6],[148,1,148,3],[110,2,111,2],[102,3,102,6],[103,3,103,6],[93,2,94,2],[93,3,93,6],[94,3,94,6],[95,2,96,2],[95,3,95,6],[96,3,96,6],[115,1,115,3],[100,2,100,7],[95,7,96,7],[97,7,98,7],[102,7,103,7],[93,7,94,7],[112,3,112,6],[113,3,113,6],[97,2,98,2],[97,3,97,6],[98,3,98,6],[102,2,103,2],[4,1,4,3],[11,1,11,3],[36,1,36,3],[63,1,63,3],[110,3,110,6],[26,3,27,9],[110,7,111,7],[104,7,105,7],[106,7,107,7],[83,7,84,7],[85,7,86,7],[87,7,88,7],[89,7,90,7],[91,7,92,7],[89,2,90,2],[89,3,89,6],[9,3,9,9],[155,3,155,8],[156,3,156,8],[141,3,141,6],[143,3,143,6],[144,3,144,6],[145,3,145,6],[146,3,146,6],[109,3,109,6],[82,3,82,6],[24,3,24,8],[32,3,32,8],[19,3,20,9],[22,3,22,9],[112,7,113,7],[108,7,109,7],[16,3,16,8],[44,3,45,9],[83,2,84,2],[85,2,86,2],[87,2,88,2],[87,3,87,6],[88,3,88,6],[83,3,83,6],[84,3,84,6],[85,3,85,6],[86,3,86,6],[73,3,73,6],[29,3,30,9],[34,3,34,8],[91,2,92,2],[91,3,91,6],[92,3,92,6],[44,15,46,15],[159,3,159,8],[104,2,105,2],[104,3,104,6],[105,3,105,6],[106,2,107,2],[106,3,106,6],[107,3,107,6],[108,2,109,2],[108,3,108,6],[157,3,158,9],[111,3,111,6],[112,2,113,2],[169,3,169,6],[162,3,162,6],[163,3,163,6],[164,3,164,6],[167,3,167,6],[168,3,168,6]]}
[null,"Materials and Resources",null,null,null,null,null,null,null,null,null,"Notes","Verified \n(initials)","Date \nVerified","QAD Notes","Verification Measure","QAD Notes"]
[]
[null,null,null,null,"Preliminary    Y",{"$f":"SUM(F39,F66,F151,F118)","v":0},"Maybe",{"$f":"SUM(H39,H66,H151,H118)","v":0},"Verified",{"$f":"SUM(J39,J66,J151,J118)","v":0}]
[]
["MRp1",{"$f":"L5","v":"MR Prerequisite Certified Tropical Wood"},null,null,null,null,null,null,null,null,"HM","MR Prerequisite Certified Tropical Wood"]
[null,null,null,null,null,null,null,null,null,null,"HM"]
[null,"Required",null,null,null,"Required",null,null,"Verified","N","HM",null,"Responsible Party"]
[null,null,null,null,null,null,null,null,null,null,"HM"]
[null,null,null,null,null,null,null,null,null,null,"HM"]
[null,null,"(Select one)","All wood in the building is nontropical, reused or reclaimed, or certified by the Forest Stewardship Council, or USGBC-approved equivalent.",null,null,null,null,null,null,"HM",null,null,null,null,"Verify that no wood used in project comes from tropical country unless reclaimed or FSC certified, using information provided by suppliers and vendors."]
[null,null,null,null,null,null,null,null,null,null,"HM"]
["MRp2",{"$f":"L12","v":"MR Prerequisite Durability Management"},null,null,null,null,null,null,null,null,"HM","MR Prerequisite Durability Management"]
[null,null,null,null,null,null,null,null,null,null,"HM"]
[null,"Required",null,null,null,"Required",null,null,"Verified","N","HM",null,"Responsible Party"]
[null,null,null,null,null,null,null,null,null,null,"HM"]
[null,null,null,null,null,null,null,null,null,null,"HM"]
[null,null,"(Select one)","ENERGY STAR for Homes, version 3, water management system builder requirements are met.",null,null,null,null,null,null,"HM"]
[null,null,null,null,null,null,null,null,null,null,"HM"]
[null,null,"Confirm all of the following have been implemented on the project:",null,null,null,null,null,null,null,"HM"]
[null,null,"(Select one)","Nonpaper-faced backer board, or a product or coating over wallboard that meets standard ASTM D 3273 standard, was installed on the area above bathtub, spa or shower, and in areas behind fiberglass enclosures where wallboard is installed.",null,null,null,null,null,null,"HM",null,null,null,null,"Conduct on-site verification that indoor moisture control measure is installed."]
[null,null,null,null,null,null,null,null,null,null,"HM"]
[null,null,null,null,null,null,null,null,null,null,"HM"]
[null,null,"(Select one)","Water-resistant flooring was installed  in the kitchen, bathroom(s), laundry room, spa area(s).  No carpet was installed in these areas.",null,null,null,null,null,null,"HM",null,null,null,null,"Conduct on-site verification that indoor moisture control measure is installed."]
[null,null,null,null,null,null,null,null,null,null,"HM"]
[null,null,"(Select one)","Water-resistant flooring was installed in entryways within 3 feet of exterior door(s).",null,null,null,null,null,null,"HM",null,null,null,null,"Conduct on-site verification that indoor moisture control measure is installed."]
[null,null,null,null,null,null,null,null,null,null,"HM"]
[null,null,"(Select one)","A drain and drain pan, drain pan and automatic water shut-off or flow restrictors, or floor drain with floor sloped to drain was installed for all tank water heaters in or over living space.",null,null,null,null,null,null,"HM",null,null,null,null,"Conduct on-site verification that indoor moisture control measure is installed."]
[null,null,null,null,null,null,null,null,null,null,"HM"]
[null,null,null,null,null,null,null,null,null,null,"HM"]
[null,null,"(Select one)","A braided washer hose, drain and drain pan, drain pan and automatic water shut-off or flow restrictors, or floor drain with floor sloped to drain was installed for clothes washer in or over living space.",null,null,null,null,null,null,"HM",null,null,null,null,"Conduct on-site verification that indoor moisture control measure is installed."]
[null,null,null,null,null,null,null,null,null,null,"HM"]
[null,null,null,null,null,null,null,null,null,null,"HM"]
[null,null,"(Select one)","Conventional clothes dryers exhaust directly to outdoors.",null,null,null,null,null,null,"HM",null,null,null,null,"Conduct on-site verification that indoor moisture control measure is installed."]
[null,null,null,null,null,null,null,null,null,null,"HM"]
[null,null,"(Select one)","After completion of construction, test to verify that there are no detectable water leaks.",null,null,null,null,null,null,"HM",null,null,null,null,"Conduct on-site verification that indoor moisture control measure is installed."]
[null,null,null,null,null,null,null,null,null,null,"HM"]
["MRc1",{"$f":"L37","v":"MR Credit Durability Management Verification"},null,null,null,null,null,null,null,null,"HM","MR Credit Durability Management Verification"]
[null,null,null,null,null,null,null,null,null,null,"HM"]
[null,"Up to 3 points",null,null,"Preliminary    Y",{"$f":"IFERROR(SUM(F42,F48,F54),0)","v":0},"M",{"$f":"IFERROR(SUM(H42,H48,H54),0)","v":0},"Verified",{"$f":"IFERROR(SUM(J42,J48,J54),0)","v":0},"HM",null,"Responsible Party"]
[null,null,null,null,null,null,null,null,null,null,"HM"]
[null,null,null,null,null,null,null,null,null,null,"HM"]
[null,null,"Option 1: Water Management System (1 point)",null,"Y",null,"M",null,"V"]
[null,null,null,null,null,null,null,null,null,null,"HM"]
[]
[null,null,"(Select one)","Each measure in the ENERGY STAR for Homes, version 3, water management system builder requirements were verified by the verification team.",null,null,null,null,null,null,"HM",null,null,null,null,"Conduct on-site verification of each measured listed in ENERGY STAR for Homes water management system checklist, or verify that qualified energy rater signed off on each measure."]
[null,null,null,null,null,null,null,null,null,null,"HM"]
[null,null,"AND/OR"]
[null,null,"Option 2. Overhangs (1 point)",null,"Y",null,"M",null,"V"]
[null,null,null,null,null,null,null,null,null,null,"HM"]
[null,null,null,null,null,null,null,null,null,null,"HM"]
[null,null,"(Select one)","Each exterior door is protected by compliant overhang, roof or awning",null,null,null,null,null,null,null,null,null,null,null,"Verify each exterior door is protected by compliant overhang, roof or awning"]
[]
[null,null,"AND/OR"]
[null,null,"Option 3. Plumbing Condensation Control (1 point)",null,"Y",null,"M",null,"V"]
[]
[]
[null,null,"Select one of the following: "]
[null,null,"(Select one)","R-4 insulation install on all domestic cold water piping in unconditioned space",null,null,null,null,null,null,null,null,null,null,null,"Verify R-4 insulation install on all domestic cold water piping in unconditioned space"]
[]
[null,null,"OR",null,null,null,null,null,null,null,null,null,null,null,null,"OR"]
[]
[null,null,"(Select one)","No cold water piping installed in unconditioned spaces",null,null,null,null,null,null,"HM",null,null,null,null,"Verify no cold water piping installed in unconditioned spaces"]
[]
["MRc2",{"$f":"L64","v":"MR Credit Environmentally Preferable Products"},null,null,null,null,null,null,null,null,"HM","MR Credit Environmentally Preferable Products"]
[null,null,null,null,null,null,null,null,null,null,"HM"]
[null,"Up to 5 points",null,null,"Preliminary    Y",{"$f":"IF(Instructions!$J$85=1,IF(SUM(F70,F79)>5,5,SUM(F70,F79)))","v":0},"M",{"$f":"IF(Instructions!$J$85=1,IF(SUM(H70,H79)>5,5,SUM(H70,H79)))","v":0},"Verified",{"$f":"IF(Instructions!$J$85=1,IF(SUM(J70,J79)>5,5,SUM(J70,J79)))","v":0},"HM",null,"Responsible Party"]
[null,"Exemplary Performance: Earn more than the maximum 5 points",null,null,null,null,null,null,null,null,"HM"]
[null,null,null,null,null,null,null,null,null,null,"HM"]
[null,null,null,null,null,null,null,null,null,null,"HM"]
[null,null,"Option 1. Local Production",null,"Preliminary    Y",null,"M",null,"Verified",null,"HM",{"$f":"C70","v":"Option 1. Local Production"}]
[null,null,null,null,null,null,null,null,null,null,"HM"]
[null,null,null,null,null,null,null,null,null,null,"HM"]
[null,null,"Select which the following were extracted, processed, and manufactured within 100 miles (160 km) of the project site:",null,null,null,null,null,null,null,"HM"]
[null,null,null,"Percentage of locally produced framing (%) (1 point)",null,null,null,null,null,null,"HM",null,null,null,null,"Verify that installed components meet definition of local production, using product literature, letters from manufacturers or suppliers, or other documentation."]
[null,null,null,"Percentage of locally produced aggregate for concrete and foundation (%) (1 point)",null,null,null,null,null,null,"HM",null,null,null,null,"Verify that installed components meet definition of local production, using product literature, letters from manufacturers or suppliers, or other documentation."]
[null,null,null,"Percentage of locally produced drywall and interior sheathing (%) (1 point)",null,null,null,null,null,null,"HM",null,null,null,null,"Verify that installed components meet definition of local production, using product literature, letters from manufacturers or suppliers, or other documentation."]
[null,null,null,null,null,null,null,null,null,null,"HM"]
[null,null,"AND/OR",null,null,null,null,null,null,null,"HM"]
[null,null,"Option 2. Environmentally Preferable Products",null,"Preliminary    Y",null,"M",null,"Verified",null,"HM",{"$f":"C79","v":"Option 2. Environmentally Preferable Products"}]
[null,null,null,null,null,null,null,null,null,null,"HM"]
[null,null,null,null,null,null,null,null,null,null,"HM"]
[null,null,"Select the criteria met by at least 50% of the component for 1 point. At least 90% for 2 points.",null,null,null,null,"Percentage of Component",null,null,"HM"]
[null,null,"No Floor Covering",null,null,null,null,null,null,null,"HM",null,null,null,null,"Verify that installed components satisfy specific credit requirements, using product literature, labels, or other documentation."]
[null,null,"Floor Covering",null,null,null,null,null,null,null,"HM",null,null,null,null,"Verify that installed components satisfy specific credit requirements, using product literature, labels, or other documentation."]
[null,null,null,null,null,null,null,null,null,null,"HM"]
[null,null,"Insulation",null,null,null,null,null,null,null,"HM",null,null,null,null,"Verify that installed components satisfy specific credit requirements, using product literature, labels, or other documentation."]
[null,null,null,null,null,null,null,null,null,null,"HM"]
[null,null,"Sheathing",null,null,null,null,null,null,null,"HM",null,null,null,null,"Verify that installed components satisfy specific credit requirements, using product literature, labels, or other documentation."]
[null,null,null,null,null,null,null,null,null,null,"HM"]
[null,null,"Framing",null,null,null,null,null,null,null,"HM",null,null,null,null,"Verify that installed components satisfy specific credit requirements, using product literature, labels, or other documentation."]
[null,null,null,null,null,null,null,null,null,null,"HM"]
[null,null,"Drywall",null,null,null,null,null,null,null,"HM",null,null,null,null,"Verify that installed components satisfy specific credit requirements, using product literature, labels, or other documentation."]
[null,null,null,null,null,null,null,null,null,null,"HM"]
[null,null,"Concrete",null,null,null,null,null,null,null,"HM",null,null,null,null,"Verify that installed components satisfy specific credit requirements, using product literature, labels, or other documentation."]
[null,null,null,null,null,null,null,null,null,null,"HM"]
[null,null,"Roofing",null,null,null,null,null,null,null,"HM",null,null,null,null,"Verify that installed components satisfy specific credit requirements, using product literature, labels, or other documentation."]
[null,null,null,null,null,null,null,null,null,null,"HM"]
[null,null,"Siding",null,null,null,null,null,null,null,"HM",null,null,null,null,"Verify that installed components satisfy specific credit requirements, using product literature, labels, or other documentation."]
[null,null,null,null,null,null,null,null,null,null,"HM"]
[]
[null,null,"Select criteria for any of the following additional components for at least 90% of the component (1 point per component):"]
[]
[null,null,"Doors",null,null,null,null,null,null,null,"HM",null,null,null,null,"Verify that installed components satisfy specific credit requirements, using product literature, labels, or other documentation."]
[null,null,null,null,null,null,null,null,null,null,"HM"]
[null,null,"Cabinets",null,null,null,null,null,null,null,"HM",null,null,null,null,"Verify that installed components satisfy specific credit requirements, using product literature, labels, or other documentation."]
[null,null,null,null,null,null,null,null,null,null,"HM"]
[null,null,"Counters",null,null,null,null,null,null,null,"HM",null,null,null,null,"Verify that installed components satisfy specific credit requirements, using product literature, labels, or other documentation."]
[null,null,null,null,null,null,null,null,null,null,"HM"]
[null,null,"Interior Trim",null,null,null,null,null,null,null,"HM",null,null,null,null,"Verify that installed components satisfy specific credit requirements, using product literature, labels, or other documentation."]
[null,null,null,null,null,null,null,null,null,null,"HM"]
[null,null,"Decking/Patio",null,null,null,null,null,null,null,"HM",null,null,null,null,"Verify that installed components satisfy specific credit requirements, using product literature, labels, or other documentation."]
[null,null,null,null,null,null,null,null,null,null,"HM"]
[null,null,"Windows",null,null,null,null,null,null,null,"HM",null,null,null,null,"Verify that installed components satisfy specific credit requirements, using product literature, labels, or other documentation."]
[null,null,null,null,null,null,null,null,null,null,"HM"]
[null,null,null,null,null,null,null,null,null,null,"HM"]
["MRc3",{"$f":"L116","v":"MR Credit Construction Waste Management"},null,null,null,null,null,null,null,null,"HM","MR Credit Construction Waste Management"]
[null,null,null,null,null,null,null,null,null,null,"HM"]
[null,"Up to 2 points",null,null,"Preliminary    Y",{"$f":"IF(F122>0,F122,F139)","v":0},"M",{"$f":"IF(H122>0,H122,H139)","v":0},"Verified",{"$f":"IF(J122>0,J122,J139)","v":0},"HM",null,"Responsible Party"]
[null,"Exemplary Performance: For renovation projects using Option 2, track and divert at least 50% of demolition waste.",null,null,null,null,null,null,null,null,"HM"]
[null,null,null,null,null,null,null,null,null,null,"HM"]
[]
[null,null,"Option 1. Diversion (1-2 points)",null,"Y",null,"M",null,"V",null,"HM",{"$f":"C122","v":"Option 1. Diversion (1-2 points)"}]
[]
[]
[null,null,null,"Diverted material streams"]
[]
[null,null,"Path 1. Divert 50% and three material streams (1 point)",null,null,null,null,null,null,null,null,{"$f":"C127","v":"Path 1. Divert 50% and three material streams (1 point)"}]
[null,null,null,null,null,null,null,null,null,null,"HM"]
[null,null,null,null,null,null,null,null,null,null,"HM"]
[null,null,null,"Diversion rate of the total construction and demolition material",null,null,null,null,null,null,null,null,null,null,null,"Verify the diversion rate of the total construction and demolition material"]
[]
[null,null,"OR",null,null,null,null,null,null,null,null,{"$f":"C132","v":"OR"}]
[null,null,"Path 2. Divert 75% and four material streams (2 points)",null,null,null,null,null,null,null,null,{"$f":"C133","v":"Path 2. Divert 75% and four material streams (2 points)"}]
[null,null,null,null,null,null,null,null,null,null,"HM"]
[null,null,null,null,null,null,null,null,null,null,"HM"]
[null,null,null,"Diversion rate of the total construction and demolition material",null,null,null,null,null,null,null,null,null,null,null,"Verify the diversion rate of the total construction and demolition material"]
[]
[null,null,"OR",null,null,null,null,null,null,null,null,{"$f":"C138","v":"OR"}]
[null,null,"Option 2. Reduction of total waste material (2 points)",null,"Y",null,"M",null,"V",null,null,{"$f":"C139","v":"Option 2. Reduction of total waste material (2 points)"}]
[]
[]
[null,null,{"$f":"IF(Instructions!F65=\"\",\"\",IF(Instructions!F65=0,4200,(VLOOKUP(Instructions!F65,'MRc Construction Waste Mgmt'!A1:C18,3,FALSE))))","v":""},{"$f":"CONCATENATE(\"LEED Reference Home Baseline Waste\",IF(Instructions!$I$85=1,\" (lbs)\",\" (kg)\"))","v":"LEED Reference Home Baseline Waste (lbs)"},null,null,null,null,null,null,"HM",null,null,null,null,"Verify that calculations of construction waste rate are based on waste hauling documents."]
[null,null,null,null,null,null,null,null,null,null,"HM"]
[null,null,null,{"$f":"CONCATENATE(\"Total Construction Waste (including recycled waste)\",IF(Instructions!$I$85=1,\" (lbs)\",\" (kg)\"))","v":"Total Construction Waste (including recycled waste) (lbs)"},null,null,null,null,null,null,"HM"]
[null,null,null,{"$f":"CONCATENATE(\"Recycled Waste\",IF(Instructions!$I$85=1,\" (lbs)\",\" (kg)\"))","v":"Recycled Waste (lbs)"},null,null,null,null,null,null,"HM"]
[null,null,{"$f":"IF(C144-(0.25*C145),C144-(0.25*C145),\"\")","v":""},{"$f":"CONCATENATE(\"Project Construction Waste\",IF(Instructions!$I$85=1,\" (lbs)\",\" (kg)\"))","v":"Project Construction Waste (lbs)"},null,null,null,null,null,null,"HM"]
[null,null,{"$f":"IFERROR(IF(AND(C142=\"\",C144=\"\",C145=\"\"),\"\",(1-(C146/C142))),0)","v":""},"Percent reduction below baseline (%)",null,null,null,null,null,null,"HM"]
[null,null,null,null,null,null,null,null,null,null,"HM"]
["MRc4",{"$f":"L149","v":"MR Credit Material-Efficient Framing"},null,null,null,null,null,null,null,null,"H","MR Credit Material-Efficient Framing"]
[null,null,null,null,null,null,null,null,null,null,"H"]
[null,"Up to 2 points",null,null,"Preliminary    Y",0,"M",0,"Verified",0,"H",null,"Responsible Party"]
[null,"Exemplary Performance: Earn more than the maximum 2 points",null,null,null,null,null,null,null,null,"H"]
[null,null,null,null,null,null,null,null,null,null,"H"]
[null,null,null,null,null,null,null,null,null,null,"H"]
[null,null,"Select one of the following for at least 90% of each component: (1 point)",null,null,null,null,null,null,null,"H"]
[null,null,"(Select one)","No more than one horizontal 2x top plate on walls by aligning studs with joists and roof rafters was installed.  ",null,null,null,null,null,null,"H",null,null,null,null,"Conduct on-site verification that framing was installed per credit requirements."]
[null,null,"(Select one)","Window and door headers were placed in the rim joist.",null,null,null,null,null,null,"H",null,null,null,null,"Conduct on-site verification that framing was installed per credit requirements."]
[null,null,"(Select one)","Raised (directly beneath the top plate), single-ply headers not more than 2 inches nominal thickness in a 2x4 wall or 4 inches nominal thickness in a 2x6 wall, were installed.",null,null,null,null,null,null,"H",null,null,null,null,"Conduct on-site verification that framing was installed per credit requirements."]
[null,null,null,null,null,null,null,null,null,null,"H"]
[null,null,"(Select one)","Structural insulated panels (SIPs) were installed for walls. ",null,null,null,null,null,null,"H",null,null,null,null,"Conduct on-site verification that framing was installed per credit requirements."]
[null,null,null,null,null,null,null,null,null,null,"H"]
[null,null,"Select at least 2 of the following for at least 90% of each component: (1 point)",null,null,null,null,null,null,null,"H"]
[null,null,"(Select one)","Headers were sized for actual loads.",null,null,null,null,null,null,"H",null,null,null,null,"Conduct on-site verification that framing was installed per credit requirements."]
[null,null,"(Select one)","Ladder blocking or drywall clips were used.",null,null,null,null,null,null,"H",null,null,null,null,"Conduct on-site verification that framing was installed per credit requirements."]
[null,null,"(Select one)","Two-stud corners or California corners were used.",null,null,null,null,null,null,"H",null,null,null,null,"Conduct on-site verification that framing was installed per credit requirements."]
[null,null,null,null,null,null,null,null,null,null,"H"]
[null,null,"Select all that apply for at least 90% of each component: (1 point each)",null,null,null,null,null,null,null,"H"]
[null,null,"(Select one)","Interior wall studs were spaced greater than 16 inches (400 mm) o.c. ",null,null,null,null,null,null,"H",null,null,null,null,"Conduct on-site verification that framing was installed per credit requirements."]
[null,null,"(Select one)","Floor joists were spaced greater than 16 inches (400 mm) o.c. ",null,null,null,null,null,null,"H",null,null,null,null,"Conduct on-site verification that framing was installed per credit requirements."]
[null,null,"(Select one)","Roof rafters were spaced greater than 16 inches (400 mm) o.c ",null,null,null,null,null,null,"H",null,null,null,null,"Conduct on-site verification that framing was installed per credit requirements."]

{"sheet":"EQ","index":14,"n_rows":362,"n_cols":17,"rows_kept":362,"cut":false,"hidden":false,"merged":[[360,3,360,8],[361,3,361,8],[20,3,20,8],[345,3,345,8],[57,3,57,7],[113,3,113,7],[58,3,58,7],[61,3,61,7],[64,3,64,7],[358,3,358,8],[334,1,334,3],[343,3,343,8],[265,3,265,8],[355,3,355,8],[356,3,356,9],[251,3,251,8],[128,15,129,15],[116,1,116,3],[132,1,132,3],[157,1,157,3],[253,1,253,3],[124,3,124,7],[126,3,126,7],[141,2,141,3],[122,3,122,8],[141,4,142,9],[150,3,150,7],[175,3,175,7],[196,3,196,7],[190,3,190,8],[247,3,247,7],[249,3,249,9],[4,1,4,3],[29,1,29,3],[50,1,50,3],[70,1,70,3],[106,1,106,3],[90,3,90,9],[88,3,88,7],[13,3,14,9],[89,3,89,7],[66,3,66,7],[68,3,68,7],[40,3,40,7],[44,3,44,7],[46,3,46,7],[27,3,27,9],[48,3,48,7],[16,3,16,8],[18,3,18,8],[188,3,188,7],[114,3,114,7],[147,3,148,9],[166,3,167,9],[85,3,85,7],[36,3,36,7],[37,3,37,7],[169,3,169,9],[92,3,93,9],[177,3,177,7],[185,3,185,7],[99,3,99,7],[102,3,102,7],[104,3,104,7],[267,3,268,9],[348,3,348,7],[353,3,353,7],[272,2,272,7],[341,2,341,9],[350,3,350,8],[346,3,346,8],[351,3,351,8]]}
[null,"Indoor Environmental Quality",null,null,null,null,null,null,null,null,null,"Notes","Verified \n(initials)","Date \nVerified","QAD Notes","Verification Measure","QAD \nVerification Notes"]
[]
[null,null,null,null,"Preliminary    Y",{"$f":"SUM(F337,F256,F160,F135)","v":0},"Maybe",{"$f":"SUM(H337,H256,H160,H135)","v":0},"Verified",{"$f":"SUM(J337,J256,J160,J135)","v":0}]
[]
["EQp1",{"$f":"L5","v":"EQ Prerequisite Ventilation"},null,null,null,null,null,null,null,null,"HM","EQ Prerequisite Ventilation"]
[null,null,null,null,null,null,null,null,null,null,"HM"]
[null,"Required",null,null,null,"Required",null,null,"Verified",{"$f":"IF(OR(J10=\"Y\",J12=\"Y\"),\"Y\",\"N\")","v":"N"},"HM",null,"Responsible Party"]
[null,null,null,null,null,null,null,null,null,null,"HM"]
[null,null,null,null,null,null,null,null,null,null,"HM"]
[null,null,"(Select one)","The project has earned the EPA Indoor airPLUS label",null,null,null,null,"V",null,"HM"]
[null,null,"OR",null,null,null,null,null,null,null,"HM"]
[null,null,"Local Exhaust",null,null,null,null,null,"V",null,"HM",{"$f":"C12","v":"Local Exhaust"}]
[null,null,"Confirm all of the following have been implemented on the project:",null,null,null,null,null,null,null,"HM"]
[null,null,"(Select one)","Local exhaust systems designed and third-party tested to meet the requirements of ASHRAE Standard 62.2–2016, Sections 5 and 7 or local equivalent, whichever is more stringent, were installed in all bathrooms (including half-baths) and the kitchen.",null,null,null,null,null,null,"HM",null,null,null,null,"Verify that bathroom fans meet prerequisite requirements for sound and performance AND Test exhaust fans to ensure they are exhausting sufficient airflow to meet prerequisite requirements, and verify that exhaust goes directly to outdoors."]
[null,null,null,null,null,null,null,null,null,null,"HM",null,null,null,null,"Verify that kitchen fans meet prerequisite requirements for sound and performance; AND Test exhaust fans to ensure they are exhausting sufficient airflow to meet prerequisite requirements, and verify that exhaust goes directly to outdoors."]
[null,null,null,null,null,null,null,null,null,null,"HM"]
[null,null,"(Select one)","Local exhaust systems exhaust air directly to the outdoors.",null,null,null,null,null,null,"HM"]
[null,null,null,null,null,null,null,null,null,null,"HM"]
[null,null,"(Select one)","All bathroom exhaust fans are ENERGY STAR-labeled or an HRV or ERV is used.",null,null,null,null,null,null,"HM"]
[null,null,null,null,null,null,null,null,null,null,"HM"]
[null,null,"(Select one)","For exhaust hood systems capable of exhausting in excess of 400 cubic feet per minute (188 liters per second), makeup air is provided at a rate approximately equal to the exhaust air rate. Makeup air systems have a means of closure and can be automatically controlled to start and operate simultaneously with the exhaust system.",null,null,null,null,null,null,"HM",null,null,null,null,"If exhaust hood can exhaust more than 400 cfm, conduct on-site verification that makeup air source is installed with damper that opens when exhaust fan is turned on."]
[]
[null,null,"AND"]
[null,null,null,null,null,null,null,null,null,null,"HM"]
[null,null,"Whole House Mechanical Ventilation",null,null,null,null,null,null,null,"HM",{"$f":"C25","v":"Whole House Mechanical Ventilation"}]
[null,null,"(Select one)","The building is designed and third-party tested to meet ASHRAE Standard 62.2-2016 Sections 4, 6.7 and 6.8 or local equivalent, whichever is more stringent.",null,null,null,null,null,null,"HM",null,null,null,null,"Verify that whole house mechanical ventilation calculation is correct AND Test ventilation to ensure that the system is moving sufficient air to meet prerequisite requirements."]
[null,null,null,null,null,null,null,null,null,null,"HM"]
[null,null,"(Select one)","Whole house ventilation fans must be rated for sound at a maximum of 1.0 sone per ASHRAE 62.2–2016, Section 7.2.1. Remote mounted fans need not meet these sound requirements.",null,null,null,null,null,null,"HM",null,null,null,null,"Verify that whole house mechanical ventilation calculation is correct AND Test ventilation to ensure that the system is moving sufficient air to meet prerequisite requirements."]
[null,null,null,null,null,null,null,null,null,null,"HM"]
["EQp2",{"$f":"L30","v":"EQ Prerequisite Combustion Venting"},null,null,null,null,null,null,null,null,"HM","EQ Prerequisite Combustion Venting"]
[null,null,null,null,null,null,null,null,null,null,"HM"]
[null,"Required",null,null,null,"Required",null,null,"Verified","N","HM",null,"Responsible Party"]
[null,null,null,null,null,null,null,null,null,null,"HM"]
[null,null,null,null,null,null,null,null,null,null,"HM"]
[null,null,"(Select one)","The project has earned the EPA Indoor airPLUS label",null,null,null,null,null,null,"HM"]
[null,null,null,"OR",null,null,null,null,null,null,"HM"]
[null,null,"(Select one)","No unvented combustion appliances were installed (ovens and ranges excluded).",null,null,null,null,null,null,"HM",null,null,null,null,"Conduct on-site verification that no unvented combustion appliances are installed."]
[null,null,"(Select one)","A carbon monoxide (CO) monitor is installed on each floor, hard-wired with a battery backup. ",null,null,null,null,null,null,"HM",null,null,null,null,"Conduct on-site verification that carbon monoxide monitors or sensors are installed on each floor and in every unit."]
[null,null,null,null,null,null,null,null,null,null,"HM"]
[null,null,"For projects with fireplaces or woodstoves installed",null,null,null,null,null,null,null,"HM",{"$f":"C40","v":"For projects with fireplaces or woodstoves installed"}]
[null,null,"(Select one)","Provide doors that close or a solid glass enclosure.",null,null,null,null,null,null,"HM",null,null,null,null,"Conduct on-site verification that any fireplace or woodstove has doors or seal AND for any fireplaces or woodstoves that are not closed-combustion or power-vented, conduct combustion appliance zone depressurization to ensure depressurization of zone is less than 5 Pa."]
[null,null,null,null,null,null,null,null,null,null,"HM"]
[null,null,"For projects where space and water heating equipment involving combustion are installed",null,null,null,null,null,null,null,"HM",{"$f":"C43","v":"For projects where space and water heating equipment involving combustion are installed"}]
[null,null,"Select one of the following:",null,null,null,null,null,null,null,"HM"]
[null,null,"(Select one)","Equipment is installed with closed combustion (i.e. sealed supply air and exhaust ducting)",null,null,null,null,null,null,"HM",null,null,null,null,"Conduct on-site verification that any combustion space- or water-heating equipment is installed with closed combustion or power-vented exhaust or is located in a detached building or open-air facility."]
[null,null,null,null,null,null,null,null,null,null,"HM"]
[null,null,"(Select one)","Equipment is installed with power-vented exhaust",null,null,null,null,null,null,"HM"]
[null,null,null,null,null,null,null,null,null,null,"HM"]
[null,null,"(Select one)","Equipment is located in a detached utility building or open-air facility",null,null,null,null,null,null,"HM"]
[null,null,null,null,null,null,null,null,null,null,"HM"]
["EQp3",{"$f":"L51","v":"EQ Prerequisite Garage Pollutant Protection"},null,null,null,null,null,null,null,null,"HM","EQ Prerequisite Garage Pollutant Protection"]
[null,null,null,null,null,null,null,null,null,null,"HM"]
[null,"Required",null,null,null,"Required",null,null,"Verified","N","HM",null,"Responsible Party"]
[null,null,null,null,null,null,null,null,null,null,"HM"]
[null,null,null,null,null,null,null,null,null,null,"HM"]
[null,null,"(Select one)","The project has earned the EPA Indoor airPLUS label",null,null,null,null,null,null,"HM"]
[null,null,null,"OR",null,null,null,null,null,null,"HM"]
[null,null,"(Select one)","All air-handling equipment and ductwork is placed outside the fire-rated envelope of the garage.",null,null,null,null,null,null,"HM",null,null,null,null,"Conduct on-site verification that all air-handling equipment and ductwork are located outside fire-rated envelope of garage."]
[null,null,"(Select one)","Shared surfaces between the garage and conditioned spaces are tightly sealed.",null,null,null,null,null,null,"HM"]
[null,null,null,null,null,null,null,null,null,null,"HM"]
[null,null,"Conditioned Spaces Above Garage",null,null,null,null,null,null,null,"HM",{"$f":"C61","v":"Conditioned Spaces Above Garage"}]
[null,null,"(Select one)","All penetrations and all connecting floor and ceiling joist bays are sealed.",null,null,null,null,null,null,"HM",null,null,null,null,"Conduct on-site verification that surfaces between garage and conditioned spaces are sealed and weather-stripped."]
[null,null,null,null,null,null,null,null,null,null,"HM"]
[null,null,"Conditioned Spaces Next to Garage",null,null,null,null,null,null,null,"HM",{"$f":"C64","v":"Conditioned Spaces Next to Garage"}]
[null,null,"(Select one)","All doors are weather-stripped.",null,null,null,null,null,null,"HM",null,null,null,null,"Conduct on-site verification that carbon monoxide monitors are installed in all rooms that share door with garage."]
[null,null,null,null,null,null,null,null,null,null,"HM"]
[null,null,"(Select one)","Carbon monoxide detectors are installed in rooms that share a door with the garage",null,null,null,null,null,null,"HM"]
[null,null,null,null,null,null,null,null,null,null,"HM"]
[null,null,"(Select one)","All penetrations and all cracks at the base of the walls are sealed. ",null,null,null,null,null,null,"HM"]
[null,null,null,null,null,null,null,null,null,null,"HM"]
["EQp4",{"$f":"L71","v":"EQ Prerequisite Radon-Resistant Construction"},null,null,null,null,null,null,null,null,"HM","EQ Prerequisite Radon-Resistant Construction"]
[null,null,null,null,null,null,null,null,null,null,"HM"]
[null,"Required",null,null,null,"Required",null,null,"Verified",{"$f":"IF(OR(J77=\"Y\",J83=\"Y\",J97=\"Y\"),\"Y\",\"N\")","v":"N"},"HM",null,"Responsible Party"]
[null,"Exemplary Performance: For projects in radon zones 2 and 3, install a qualifying passive radon ventilation system.",null,null,null,null,null,null,null,null,"HM"]
[null,null,null,null,null,null,null,null,null,null,"HM"]
[null,null,null,null,null,null,null,null,null,null,"HM"]
[null,null,"EPA Indoor airPLUS label",null,null,null,null,null,"V",null,"HM",{"$f":"C77","v":"EPA Indoor airPLUS label"}]
[null,null,null,null,null,null,null,null,null,null,"HM"]
[null,null,null,null,null,null,null,null,null,null,"HM"]
[null,null,"(Select one)","The project has earned the EPA Indoor airPLUS label",null,null,null,null,null,null,"HM"]
[null,null,null,null,null,null,null,null,null,null,"HM"]
[null,null,"OR",null,null,null,null,null,null,null,"HM"]
[null,null,"Case 1. New Construction",null,null,null,null,null,"V",null,"HM",{"$f":"C83","v":"Case 1. New Construction"}]
[null,null,null,null,null,null,null,null,null,null,"HM"]
[null,null,null,null,null,null,null,null,null,null,"HM"]
[null,null,null,"EPA radon zone",null,null,null,null,null,null,"HM",null,null,null,null,"Conduct on-site verification that building is elevated at least 2 feet (600 millimeters), with open air space between building and ground, or built over the garage."]
[null,null,null,null,null,null,null,null,null,null,"HM"]
[null,null,"For projects in EPA radon zone 1",null,null,null,null,null,null,null,"HM",{"$f":"C88","v":"For projects in EPA radon zone 1"}]
[null,null,"(Select one)","There is a capillary break per the Indoor airPLUS specifications.",null,null,null,null,null,null,"HM",null,null,null,null,"Conduct on-site verification that radon-resistant construction elements are installed, including gas-permeable layer (e.g., gravel) and capillary break (e.g., plastic sheeting)."]
[null,null,"(Select one)","An electrical outlet has been provided near vent piping in the attic to facilitate future fan installation.",null,null,null,null,null,null,"HM",null,null,null,null,"Conduct on-site verification that radon-resistant construction elements are installed, including electrical outlet near vent piping."]
[null,null,"(Select one)","A gas-tight vertical vent pipe extending up through the conditioned spaces and terminating above the roof opening has been installed.",null,null,null,null,null,null,"HM",null,null,null,null,"Conduct on-site verification that radon-resistant construction elements are installed, including 3- or 4-inch (approximately 80- or 100-millimeter) vent piping that meets requirements."]
[null,null,null,"OR",null,null,null,null,null,null,"HM"]
[null,null,"(Select one)","The house is elevated by at least 2 feet (600 millimeters) with open air space between building and ground or there is a garage under the building.",null,null,null,null,null,null,"HM"]
[null,null,null,null,null,null,null,null,null,null,"HM"]
[null,null,null,null,null,null,null,null,null,null,"HM"]
[null,null,"OR",null,null,null,null,null,null,null,"HM"]
[null,null,"Case 2. Renovation of Existing Building",null,null,null,null,null,"V",null,"HM",{"$f":"C97","v":"Case 2. Renovation of Existing Building"}]
[null,null,null,null,null,null,null,null,null,null,"HM"]
[null,null,null,null,null,null,null,null,null,null,"HM"]
[null,null,null,"EPA radon zone",null,null,null,null,null,null,"HM",null,null,null,null,"Conduct on-site verification that building is elevated at least 2 feet (600 millimeters), with open air space between building and ground, or built over the garage."]
[null,null,null,null,null,null,null,null,null,null,"HM"]
[null,null,"For renovation projects in EPA radon zone 1 with no slab work being performed",null,null,null,null,null,null,null,"HM"]
[null,null,null,"Radon test results (pCi/L)",null,null,null,null,null,null,"HM"]
[null,null,null,null,null,null,null,null,null,null,"HM"]
[null,null,"(Select one)","If results are greater than 4 pCi/L, an active ventilation system has been installed.",null,null,null,null,null,null,"HM"]
[null,null,null,null,null,null,null,null,null,null,"HM"]
["EQp5",{"$f":"L107","v":"EQ Prerequisite Air Filtering"},null,null,null,null,null,null,null,null,"HM","EQ Prerequisite Air Filtering"]
[null,null,null,null,null,null,null,null,null,null,"HM"]
[null,"Required",null,null,null,"Required",null,null,"Verified","N","HM",null,"Responsible Party"]
[null,null,null,null,null,null,null,null,null,null,"HM"]
[null,null,null,null,null,null,null,null,null,null,"HM"]
[null,null,"(Select one)","The project has earned the EPA Indoor airPLUS label",null,null,null,null,null,null,"HM"]
[null,null,null,"OR",null,null,null,null,null,null,"HM"]
[null,null,null,"MERV rating of filters on recirculating space conditioning systems ",null,null,null,null,null,null,"HM",null,null,null,null,"Conduct on-site verification that air filters of MERV 8 or higher are installed on all forced-air heating and cooling systems, using product literature or labels AND Conduct on-site verification that mechanical air filters are installed on all nonducted forced air heating and cooling systems in air-handling unit. "]
[null,null,null,"MERV rating of filters on mechanically supplied outdoor air systems with 10 ft (3 m) or more of ductwork",null,null,null,null,null,null,"HM",null,null,null,null,"Conduct on-site verification that air filters of MERV 6 or higher are installed on all supply ventilation systems with at least 10 feet (3 meters) of ductwork, using product literature or labels. "]
[null,null,null,null,null,null,null,null,null,null,"HM"]
["EQp7",{"$f":"L117","v":"EQ Prerequisite Compartmentalization"},null,null,null,null,null,null,null,null,"HM","EQ Prerequisite Compartmentalization"]
[null,null,null,null,null,null,null,null,null,null,"HM"]
[null,"Required",null,null,null,"Required",null,null,"Verified","N","HM",null,"Responsible Party"]
[null,null,null,null,null,null,null,null,null,null,"HM"]
[null,null,null,null,null,null,null,null,null,null,"HM"]
[null,null,"For attached single-family projects",null,null,null,null,null,null,null,"HM",{"$f":"C122","v":"For attached single-family projects"}]
[null,null,"(Select one)","Each residential unit has sealed penetrations through walls, ceilings, and floors and vertical chases adjacent to units.  ",null,null,null,null,null,null,"HM",null,null,null,null,"Verify penetrations in walls, ceilings, and floors and vertical chases adjacent to the units are sealed.  "]
[null,null,null,null,null,null,null,null,null,null,"HM"]
[null,null,"(Select one)","All doors in the residential units leading to common hallways have weather-stripping.",null,null,null,null,null,null,"HM",null,null,null,null,"Verify all doors in the residential units leading to common hallways are weather-striped."]
[null,null,null,null,null,null,null,null,null,null,"HM"]
[null,null,"(Select one)","All exterior doors and operable windows have weather-stripping.",null,null,null,null,null,null,"HM",null,null,null,null,"Verify all exterior doors and operable windows are weather-stripped."]
[null,null,null,null,null,null,null,null,null,null,"HM"]
[null,null,null,{"$f":"CONCATENATE(\"Blower door test results\",IF(Instructions!$I$85=1,\" (cfm50)\",\" (lps50/sq m)\"))","v":"Blower door test results (cfm50)"},null,null,null,null,null,null,"HM",null,null,null,null,"Conduct on-site testing of compartmentalization using a blower door; OR verify compartmentalization test results."]
[null,null,null,{"$f":"CONCATENATE(\"Envelope enclosure area\",IF(Instructions!$I$85=1,\" (sq ft)\",\" (sq m)\"))","v":"Envelope enclosure area (sq ft)"},null,null,null,null,null,null,"HM"]
[null,null,{"$f":"IFERROR(C129/C130,0)","v":0},{"$f":"CONCATENATE(\"Leakage per area of enclosure\",IF(Instructions!$I$85=1,\" (cfm50/sq ft)\",\" (lps50/sq m)\"))","v":"Leakage per area of enclosure (cfm50/sq ft)"},null,null,null,null,null,null,"HM"]
[null,null,null,null,null,null,null,null,null,null,"HM"]
["EQc1",{"$f":"L133","v":"EQ Credit Enhanced Ventilation"},null,null,null,null,null,null,null,null,"HM","EQ Credit Enhanced Ventilation"]
[null,null,null,null,null,null,null,null,null,null,"HM"]
[null,"Up to 3 points",null,null,"Preliminary    Y",{"$f":"IF(SUM(F139,F145,F153)>3,3,(SUM(F139,F145,F153)))","v":0},"M",{"$f":"IF(SUM(H139,H145,H153)>3,3,(SUM(H139,H145,H153)))","v":0},"Verified",{"$f":"IF(SUM(J139,J145,J153)>3,3,(SUM(J139,J145,J153)))","v":0},"HM",null,"Responsible Party"]
[null,"Exemplary Performance: Earn more than the maximum 3 points"]
[null,null,null,null,null,null,null,null,null,null,"HM"]
[null,null,null,null,null,null,null,null,null,null,"HM"]
[null,null,"Option 1. Enhanced Local Exhaust (1 point)",null,"Y",null,"M",null,"V",null,"HM",{"$f":"C139","v":"Option 1. Enhanced Local Exhaust (1 point)"}]
[null,null,null,null,null,null,null,null,null,null,"HM"]
[null,null,null,null,null,null,null,null,null,null,"HM"]
[null,null,null,null,"Bathroom exhaust fan control type in every bathroom with a shower, bathtub, or spa",null,null,null,null,null,"HM",null,null,null,null,"Conduct on-site verification that each full bathroom has exhaust fan that either is controlled by occupancy sensor, humidistat, or delay timer that operates fan for at least 20 minutes, or runs continuously."]
[null,null,null,null,null,null,null,null,null,null,"HM"]
[null,null,"AND/OR",null,null,null,null,null,null,null,"HM"]
[null,null,"Option 2. Enhanced Whole-House Ventilation (2 points)",null,"Y",null,"M",null,"V",null,"HM",{"$f":"C145","v":"Option 2. Enhanced Whole-House Ventilation (2 points)"}]
[null,null,null,null,null,null,null,null,null,null,"HM"]
[null,null,null,null,null,null,null,null,null,null,"HM"]
[null,null,"(Select one)","A balanced whole-house ventilation system was designed and installed that meets ASHRAE 62.2-2016 Section 4 in each home or unit.",null,null,null,null,null,null,"HM",null,null,null,null,"Conduct on-site verification that whole-house (or whole-unit) ventilation strategy is balanced."]
[]
[null,null,null,null,null,null,null,null,null,null,"HM"]
[null,null,"(Select one)","The system does not exceed ASHRAE 62.2-2010 requirements by more than 10%. ",null,null,null,null,null,null,"HM",null,null,null,null,"Conduct on-site verification that ventilation system is programmed to not exceed ASHRAE 62.2 by more than 10%."]
[null,null,"AND/OR"]
[null,null,"Option 3. Humidity Control (1 point)",null,"Y",null,"M",null,"V",null,null,{"$f":"C153","v":"Option 3. Humidity Control (1 point)"}]
[]
[]
[null,null,"(Select one)","Dehumificiation controls installed for the whole-house ventilation system.",null,null,null,null,null,null,null,null,null,null,null,"Verify dehumidification controls installed for the whole-house ventilation system."]
[null,null,null,null,null,null,null,null,null,null,"HM"]
["EQc2",{"$f":"L158","v":"EQ Credit Contaminant Control"},null,null,null,null,null,null,null,null,"HM","EQ Credit Contaminant Control"]
[null,null,null,null,null,null,null,null,null,null,"HM"]
[null,"Up to 3 points",null,null,"Preliminary    Y",{"$f":"IF(SUM(F164,F173,F181,F200,F231,F240)>3,3,SUM(F164,F173,F181,F200,F231,F240))","v":0},"M",{"$f":"IF(SUM(H164,H173,H181,H200,H231,H240)>3,3,SUM(H164,H173,H181,H200,H231,H240))","v":0},"Verified",{"$f":"IF(SUM(J164,J173,J181,J200,J231,J240)>3,3,SUM(J164,J173,J181,J200,J231,J240))","v":0},"HM",null,"Responsible Party"]
[null,"Exemplary Performance: Earn more than the maximum 3 points",null,null,null,null,null,null,null,null,"HM"]
[null,null,null,null,null,null,null,null,null,null,"HM"]
[null,null,null,null,null,null,null,null,null,null,"HM"]
[null,null,"Option 1. Walk-off Mats (1 point)",null,"Y",null,"M",null,"V",null,"HM",{"$f":"C164","v":"Option 1. Walk-off Mats (1 point)"}]
[null,null,null,null,null,null,null,null,null,null,"HM"]
[null,null,null,null,null,null,null,null,null,null,"HM"]
[null,null,"(Select one)","For all primary entryways, a permanent walk-off mat that is at least 4 feet (1.2 meters) long and allows access for cleaning has been installed.",null,null,null,null,null,null,"HM",null,null,null,null,"Conduct on-site verification that permanent, cleanable, walk-off mats at least 4 feet (1.2 meters) long are installed at each entry (for common exterior entryways in multifamily buildings, at least 10 feet, or 3 meters, long)."]
[null,null,null,null,null,null,null,null,null,null,"HM"]
[null,null,"For multifamily projects",null,null,null,null,null,null,null,"HM"]
[null,null,"(Select one)","For exterior entryways in common areas, permanent systems that are at least 10 feet (3 meters) long have been installed.",null,null,null,null,null,null,"HM"]
[null,null,null,null,null,null,null,null,null,null,"HM"]
[null,null,"AND/OR",null,null,null,null,null,null,null,"HM"]
[null,null,"Option 2. Shoe Removal and Storage (1 point)",null,"Y",null,"M",null,"V",null,"HM",{"$f":"C173","v":"Option 2. Shoe Removal and Storage (1 point)"}]
[null,null,null,null,null,null,null,null,null,null,"HM"]
[null,null,null,null,null,null,null,null,null,null,"HM"]
[null,null,"(Select one)","A shoe removal and storage space is near the primary entryway.",null,null,null,null,null,null,"HM",null,null,null,null,"Conduct on-site verification that uncarpeted shoe removal and storage space is installed near primary entryway (of each unit in multifamily buildings). "]
[null,null,null,null,null,null,null,null,null,null,"HM"]
[null,null,"(Select one)","No conventional carpet is installed in shoe removal and storage area.",null,null,null,null,null,null,"HM"]
[null,null,null,null,null,null,null,null,null,null,"HM"]
[null,null,"AND/OR",null,null,null,null,null,null,null,"HM"]
[null,null,"Option 3. Preoccupancy Flush (1 point)",null,"Y",null,"M",null,"V",null,"HM",{"$f":"C181","v":"Option 3. Preoccupancy Flush (1 point)"}]
[null,null,null,null,null,null,null,null,null,null,"HM"]
[null,null,null,null,null,null,null,null,null,null,"HM"]
[null,null,"(Select one)","The project has earned the EPA Indoor airPLUS label",null,null,null,null,null,null,"HM"]
[null,null,null,"OR",null,null,null,null,null,null,"HM"]
[null,null,"(Select one)","At installation, all permanent ducts and vents were sealed to minimize contamination from construction.",null,null,null,null,null,null,"HM",null,null,null,null,"At midconstruction site visit, conduct on-site verification that ducts are sealed."]
[null,null,null,null,null,null,null,null,null,null,"HM"]
[null,null,"After construction ends and before occupancy",null,null,null,null,null,null,null,"HM",{"$f":"C188","v":"After construction ends and before occupancy"}]
[null,null,"(Select one)","Any dust and debris was removed from ducts.",null,null,null,null,null,null,"HM",null,null,null,null,"At final site visit, conduct swipe of duct interiors and verify that ducts are clean."]
[null,null,null,null,null,null,null,null,null,null,"HM"]
[null,null,"(Select one)","The home was flushed out for 48 hours, with all windows open, a fan run continuously or all HVAC fans and exhaust fans.",null,null,null,null,null,null,"HM"]
[null,null,null,null,null,null,null,null,null,null,"HM"]
[null,null,"AND/OR",null,null,null,null,null,null,null,"HM"]
[null,null,"Option 4. Air Testing (1 point)",null,"Y",null,"M",null,"V",null,"HM",{"$f":"C194","v":"Option 4. Air Testing (1 point)"}]
[null,null,null,null,null,null,null,null,null,null,"HM"]
[null,null,null,null,null,null,null,null,null,null,"HM"]
[null,null,"(Select one)","The building was tested for indoor air contaminants and maximum concentrations were not exceeded.",null,null,null,null,null,null,"HM",null,null,null,null,"Verify indoor air contamination test results don't exceed maximum concentrations."]
[null,null,null,null,null,null,null,null,null,null,"HM"]
[null,null,"AND/OR"]
[null,null,"Option 4. Exhaust Fan in Laundry Room, Utility Room or Garage (1 point)",null,"Y",{"$f":"IF(SUM(F203,F214,F225)>1,1,SUM(F203,F214,F225))","v":0},"M",{"$f":"IF(SUM(H203,H214,H225)>1,1,SUM(H203,H214,H225))","v":0},"V",{"$f":"IF(SUM(J203,J214,J225)>1,1,SUM(J203,J214,J225))","v":0},null,{"$f":"C200","v":"Option 4. Exhaust Fan in Laundry Room, Utility Room or Garage (1 point)"}]
[null,null,"Meet one of the following:"]
[]
[null,null,"Case 1. Garage Exhaust",null,"Y",null,"M",null,"V",null,null,{"$f":"C203","v":"Case 1. Garage Exhaust"}]
[]
[]
[null,null,"(Select one)","The project has earned the EPA Indoor airPLUS label"]
[null,null,null,"OR"]
[null,null,"(Select one)","75 cfm exhaust installed that meets ENERGY STAR cfm/w performance requirements. ",null,null,null,null,null,null,null,null,null,null,null,"Verify"]
[]
[null,null,"(Select one)","Qualifying fan control is installed",null,null,null,null,null,null,null,null,null,null,null,"Verify"]
[]
[]
[null,null,"OR"]
[null,null,"Case 2. No attached garage",null,"Y",null,"M",null,"V",null,null,{"$f":"C214","v":"Case 2. No attached garage"}]
[]
[]
[null,null,"(Select one)","Do not construct a garage.",null,null,null,null,null,null,null,null,null,null,null,"Verify"]
[]
[null,null,"(Select one)","Install a detached garage, defined as a structure that does not share a wall with the home.",null,null,null,null,null,null,null,null,null,null,null,"Verify"]
[]
[null,null,"(Select one)","Install a carport, defined as an open-air space with one complete wall, which may be shared with the home.",null,null,null,null,null,null,null,null,null,null,null,"Verify"]
[]
[]
[null,null,"OR"]
[null,null,"Case 3. Utility room exhaust",null,"Y",null,"M",null,"V",null,null,{"$f":"C225","v":"Case 3. Utility room exhaust"}]
[]
[]
[null,null,"(Select one)","Energy star qualified exhaust fan installed in the laundry or utility room.",null,null,null,null,null,null,null,null,null,null,null,"Verify"]
[]
[null,null,"AND/OR"]
[null,null,"Option 5. Filtration (1 point)",null,"Y",null,"M",null,"V",null,null,{"$f":"C231","v":"Option 5. Filtration (1 point)"}]
[]
[]
[null,null,"(Select one)","MERV 10 or higher filters installed on all recirculating space conditioning systems. ",null,null,null,null,null,null,null,null,null,null,null,"Verify"]
[]
[null,null,"(Select one)","Air filter housings are airtight to prevent bypass or leakage.",null,null,null,null,null,null,null,null,null,null,null,"Verify"]
[]
[]
[null,null,"AND/OR"]
[null,null,"Option 6. Enhanced Combustion Venting Measures (1 point) ",null,"Y",null,"M",null,"V",null,null,{"$f":"C240","v":"Option 6. Enhanced Combustion Venting Measures (1 point) "}]
[]
[]
[null,null,"Meet one of the following:"]
[null,null,"(Select one)","The project has earned the EPA Indoor airPLUS label"]
[]
[null,null,"(Select one)","No fireplaces or woodstoves have been installed.",null,null,null,null,null,null,null,null,null,null,null,"Verify"]
[]
[null,null,"(Select one)","EPA qualified wood- or pellet-burning fireplaces with either power or direct venting have been installed.",null,null,null,null,null,null,null,null,null,null,null,"Verify"]
[]
[null,null,"(Select one)","A natural gas, propane, or alcohol stove approved by a safety testing facility and has power or direct venting has been installed. ",null,null,null,null,null,null,null,null,null,null,null,"Verify"]
[]
[null,null,"(Select one)","A natural gas, propane, or alcohol stove has a permanently fixed glass front or gasketed door and an electronic pilot. ",null,null,null,null,null,null,null,null,null,null,null,"Verify"]
[]
["EQc3",{"$f":"L254","v":"EQ Credit Balancing of Heating and Cooling Distribution Systems"},null,null,null,null,null,null,null,null,"HM","EQ Credit Balancing of Heating and Cooling Distribution Systems"]
[null,null,null,null,null,null,null,null,null,null,"HM"]
[null,"Up to 6 points",null,null,"Preliminary    Y",{"$f":"IF(SUM(F263,F272,F284,F290,F305,F298,F321,F330)>6,6,(SUM(F263,F272,F284,F290,F305,F298,F321,F330)))","v":0},"M",{"$f":"IF(SUM(H263,H272,H284,H290,H305,H298,H321,H330)>6,6,(SUM(H263,H272,H284,H290,H305,H298,H321,H330)))","v":0},"Verified",{"$f":"IF(SUM(J263,J272,J284,J290,J305,J298,J321,J330)>6,6,(SUM(J263,J272,J284,J290,J305,J298,J321,J330)))","v":0},"HM",null,"Responsible Party"]
[null,"Exemplary Performance: Earn more than the maximum 6 points",null,null,null,null,null,null,null,null,"HM"]
[null,null,null,null,null,null,null,null,null,null,"HM"]
[null,null,null,null,null,null,null,null,null,null,"HM"]
[null,null,"Case 1. Forced-Air Systems",null,"Y",{"$f":"SUM(F263,F272,F284)","v":0},"M",{"$f":"SUM(H263,H272,H284)","v":0},"V",{"$f":"SUM(J263,J272,J284)","v":0},"HM",{"$f":"C260","v":"Case 1. Forced-Air Systems"}]
[null,null,null,null,null,null,null,null,null,null,"HM"]
[null,null,null,null,null,null,null,null,null,null,"HM"]
[null,null,"Option 1. Multiple Zones (1 point)",null,"Y",null,"M",null,"V",null,"HM",{"$f":"C263","v":"Option 1. Multiple Zones (1 point)"}]
[null,null,null,null,null,null,null,null,null,null,"HM"]
[null,null,null,null,null,null,null,null,null,null,"HM"]
[null,null,"(Select one)","A system with at least two space-conditioning zones with independent thermostatic controls has been installed.",null,null,null,null,null,null,"HM",null,null,null,null,"Conduct on-site verification that at least two space-conditioning zones are installed."]
[null,null,null,"OR",null,null,null,null,null,null,"HM"]
[null,null,"(Select one)","The project is a single family home less than 800 sq ft (74 sq m).",null,null,null,null,null,null,"HM",null,null,null,null,"Verify that single-family home is less than 800 square feet or Verify that average unit in multifamily building is less than 1,200 square feet."]
[null,null,null,null,null,null,null,null,null,null,"HM"]
[null,null,null,null,null,null,null,null,null,null,"HM"]
[null,null,"AND/OR",null,null,null,null,null,null,null,"HM"]
[null,null,"Option 2. Supply Air-Flow Testing (1 point)",null,"Y",null,"M",null,"V",null,"HM",{"$f":"C272","v":"Option 2. Supply Air-Flow Testing (1 point)"}]
[null,null,"Exemplary Performance: Total supply air-flow rates in each room tested using a flow hood with doors closed, or another acceptable method, per RESNET or ACCA Quality Installation Specifications; results within +/- 20% (or +/- 25 cfm or 11 lps) of calculated values from ACCA Manual J.",null,null,null,null,null,null,null,"HM"]
[]
[null,null,null,null,null,null,null,null,null,null,"HM"]
[null,null,"Each heating/cooling system meets one of the following:"]
[null,null,"(Select one)","Rater tested airflow at the air handler; results within the 10% or installer-tested airflow or 15% of design. ",null,null,null,null,null,null,"HM",null,null,null,null,"Verify that ductless heating and cooling system is installed; OR Test supply air-flow rates for each room and verify that air-flow rates are within 20% or 25 cfm (11 lps) of design; OR Verify that supply air-flow rates, as tested by third-party, are within 20% or 25 cfm (11 lps) of design."]
[]
[null,null,"(Select one)","Ductless heating and cooling system",null,null,null,null,null,null,"HM"]
[]
[null,null,"(Select one)","Radiative systems have room-by-room thermostatic controls"]
[]
[null,null,"AND/OR",null,null,null,null,null,null,null,"HM"]
[null,null,"Option 3. Pressure Balancing (1 point)",null,"Y",null,"M",null,"V",null,"HM",{"$f":"C284","v":"Option 3. Pressure Balancing (1 point)"}]
[null,null,null,null,null,null,null,null,null,null,"HM"]
[null,null,null,null,null,null,null,null,null,null,"HM"]
[null,null,"(Select one)","The pressure differential between each bedroom and rest of the house is less than 3 Pa.",null,null,null,null,null,null,null,null,null,null,null,"Verify"]
[]
[null,null,"AND/OR"]
[null,null,"Option 4. Moisture load control (1 point). ",null,"Y",null,"M",null,"V",null,null,{"$f":"C290","v":"Option 4. Moisture load control (1 point). "}]
[]
[]
[null,null,"Dehumidification",null,null,null,null,null,null,null,null,{"$f":"C293","v":"Dehumidification"}]
[]
[]
[null,null,"(Select one)","Qualifying dehumidification equipment installed",null,null,null,null,null,null,null,null,null,null,null,"Verify"]
[]
[null,null,"Option 5. Remote Access Thermostat (1 point)",null,"Y",null,"M",null,"V",null,null,{"$f":"C298","v":"Option 5. Remote Access Thermostat (1 point)"}]
[null,null,"Exemplary Performance: Install an ENERGY STAR qualified smart thermostat."]
[]
[]
[null,null,"(Select one)","Remote access thermostat installed for all space heating and cooling systems. ",null,null,null,null,null,null,null,null,null,null,null,"Verify"]
[]
[null,null,"AND/OR"]
[null,null,"Option 6. Multistage Equipment (2 points)",null,"Y",{"$f":"IF(F315>0,F315,F308)","v":0},"M",{"$f":"IF(H315>0,H315,H308)","v":0},"V",{"$f":"IF(J315>0,J315,J308)","v":0},null,{"$f":"C305","v":"Option 6. Multistage Equipment (2 points)"}]
[]
[]
[null,null,"Case 1. Two stage equipment. (1 point)",null,"Y",null,"M",null,"V",null,null,{"$f":"C308","v":"Case 1. Two stage equipment. (1 point)"}]
[]
[]
[null,null,"(Select one)","All space heating and cooling systems have at least 2 speeds.",null,null,null,null,null,null,null,null,null,null,null,"Verify"]
[]
[null,null,"OR"]
[]
[null,null,"Case 2. Multi-stage equipment (2 points)",null,"Y",null,"M",null,"V",null,null,{"$f":"C315","v":"Case 2. Multi-stage equipment (2 points)"}]
[]
[]
[null,null,"(Select one)","All space heating and cooling systems have more than 2 speeds.",null,null,null,null,null,null,null,null,null,null,null,"Verify"]
[]
[null,null,"AND/OR"]
[null,null,"Option 7. Static Pressure Test (1 point)",null,"Y",null,"M",null,"V",null,null,{"$f":"C321","v":"Option 7. Static Pressure Test (1 point)"}]
[]
[]
[null,null,"Meet one of the following:"]
[null,null,"(Select one)","External static pressure no greater than 0.1 IWC compared to the design total external static pressure",null,null,null,null,null,null,null,null,null,null,null,"Verify"]
[]
[null,null,"(Select one)","All heating and cooling systems are ductless and/or radiative systems ",null,null,null,null,null,null,null,null,null,null,null,"Verify"]
[]
[null,null,"AND/OR"]
[null,null,"Option 8. Quiet Heating and Cooling Systems (1 point)",null,"Y",null,"M",null,"V",null,null,{"$f":"C330","v":"Option 8. Quiet Heating and Cooling Systems (1 point)"}]
[]
[]
[null,null,"(Select one)","Maximum background noise levels from heating and cooling systems are at or below 35 dBA for living areas and 40 dBA for kitchens and baths.",null,null,null,null,null,null,null,null,null,null,null,"Verify"]
[]
["EQc7",{"$f":"L335","v":"EQ Credit Low-Emitting Products"},null,null,null,null,null,null,null,null,"HM","EQ Credit Low-Emitting Products"]
[null,null,null,null,null,null,null,null,null,null,"HM"]
[null,"Up to 4 points",null,null,"Preliminary    Y",0,"M",0,"Verified",0,"HM",null,"Responsible Party"]
[null,"Exemplary Performance: Earn more than the maximum 4 points"]
[null,null,null,null,null,null,null,null,null,null,"HM"]
[null,null,null,null,null,null,null,null,null,null,"HM"]
[null,null,"Select all that apply. At least 50% of a component must meet the requirements to earn 1 point, or 90% for 2 points."]
[null,null,"Use materials on the building interior (everything within the waterproofing membrane) that meet the low-emitting criteria below.",null,null,null,null,null,null,null,"HM"]
[]
[null,null,"(Select one)","Paints and Coatings",null,null,null,null,null,null,"HM",null,null,null,null,"Verify that installed components satisfy requirements, using product literature or labels."]
[null,null,null,"Meet both of the following:"]
[null,null,"(Select one)","Paints and coatings meet the VOC emissions evaluation."]
[null,null,"(Select one)","Paints and coatings meet the VOC content evaluation."]
[]
[null,null,"(Select one)","Adhesives and Sealants",null,null,null,null,null,null,"HM",null,null,null,null,"Verify that installed components satisfy requirements, using product literature or labels."]
[null,null,null,"Meet both of the following:"]
[null,null,"(Select one)","Adhesives and sealants meet the VOC emissions evaluation."]
[null,null,"(Select one)","Adhesives and sealants meet the VOC content evaluation."]
[null,null,null,null,null,null,null,null,null,null,"HM"]
[null,null,"(Select one)","Flooring",null,null,null,null,null,null,"HM",null,null,null,null,"Verify that installed components satisfy requirements, using product literature or labels."]
[null,null,null,"Meet both of the following:"]
[null,null,"(Select one)","Flooring meets the VOC emissions evaluation OR inherently nonemitting sources criteria, OR salvaged and reused materials criteria."]
[null,null,"(Select one)","Includes all types of hard and soft surface flooring (carpet, ceramic, vinyl, rubber, engineered, solid wood, laminates), wall base, underlayments, and other floor coverings."]
[null,null,null,null,null,null,null,null,null,null,"HM"]
[null,null,"(Select one)","Insulation",null,null,null,null,null,null,"HM",null,null,null,null,"Verify that installed components satisfy requirements, using product literature or labels."]
[null,null,null,"Meet both of the following:",null,null,null,null,null,null,"HM"]
[null,null,"(Select one)","Insulation meets the VOC emissions evaluation."]
[null,null,"(Select one)","Includes all thermal and acoustic boards, batts, rolls, blankets, sound attenuation, fire blankets, foamed-in place, loose-fill, blown, and sprayed insulation."]

{"sheet":"IN","index":15,"n_rows":52,"n_cols":17,"rows_kept":52,"cut":false,"hidden":false,"merged":[[4,1,4,3],[11,1,11,3],[46,1,46,3],[21,2,21,4],[20,2,20,4],[13,1,13,9],[51,2,51,4],[27,2,27,4],[35,2,35,4],[34,2,34,4],[43,2,43,4],[44,2,44,4],[40,2,40,4],[41,2,41,4],[37,2,37,4],[38,2,38,4]]}
[null,"Innovation",null,null,null,null,null,null,null,null,null,"Notes","Verified \n(initials)","Date \nVerified","QAD Notes","Verification Measure","QAD \nVerification Notes"]
[]
[null,null,null,null,"Preliminary    Y",{"$f":"SUM(F15,F49)","v":0},"Maybe",{"$f":"SUM(H15,H49)","v":0},"Verified",{"$f":"SUM(J15,J49)","v":0}]
[]
["INp1",{"$f":"L5","v":"IN Prerequisite Preliminary Rating"},null,null,null,null,null,null,null,null,"HM","IN Prerequisite Preliminary Rating"]
[null,null,null,null,null,null,null,null,null,null,"HM"]
[null,"Required",null,null,null,"Required",null,null,"Verified","N","HM",null,"Responsible Party"]
[null,null,null,null,null,null,null,null,null,null,"HM"]
[null,null,null,null,null,null,null,null,null,null,"HM"]
[null,null,"(Select one)","Preliminary rating and meeting are complete.",null,null,null,null,null,null,"HM",null,null,null,null,"Participate in preliminary rating."]
[null,null,null,null,null,null,null,null,null,null,"HM"]
["INc1",{"$f":"L12","v":"IN Credit Innovation"},null,null,null,null,null,null,null,null,"HM","IN Credit Innovation"]
[null,null,null,null,null,null,null,null,null,null,"HM"]
[null,"To achieve all five innovation points, a project team must achieve at least one pilot credit, at least one innovation credit and no more than two exemplary performance credits."]
[null,"Up to 5 points",null,null,"Preliminary    Y",{"$f":"SUM(F18,F25,F31)","v":0},"M",{"$f":"SUM(H18,H25,H31)","v":0},"Verified",{"$f":"IF(SUM(J18,J25,J31)>5,5,SUM(J18,J25,J31))","v":0},"HM",null,"Responsible Party"]
[null,null,null,null,null,null,null,null,null,null,"HM"]
[null,null,null,null,null,null,null,null,null,null,"HM"]
[null,null,"Option 1. Innovation (1 point)",null,"Y",null,"M",null,"V",null,"HM",{"$f":"C18","v":"Option 1. Innovation (1 point)"}]
[null,null,null,null,null,null,null,null,null,null,"HM"]
[null,null,null,null,null,null,null,null,null,null,"HM"]
[null,null,"Describe the intent of the proposed innovation credit.",null,null,null,null,null,null,null,"HM"]
[null,null,null,null,null,null,null,null,null,null,"HM",null,null,null,null,"Verify that all components listed in USGBC-approved Innovation request are installed;"]
[null,null,null,null,null,null,null,null,null,null,"HM"]
[null,null,"AND/OR",null,null,null,null,null,null,null,"HM"]
[null,null,"Option 2. Pilot (1 point)",null,"Y",null,"M",null,"V",null,"HM",{"$f":"C25","v":"Option 2. Pilot (1 point)"}]
[null,null,null,null,null,null,null,null,null,null,"HM"]
[null,null,null,null,null,null,null,null,null,null,"HM"]
[null,null,null,null,null,"Pilot credit name ",null,null,null,null,"HM",null,null,null,null,"Verify that all components listed in USGBC-approved pilot credit are installed."]
[null,null,null,null,null,null,null,null,null,null,"HM"]
[null,null,"AND/OR",null,null,null,null,null,null,null,"HM"]
[null,null,"Option 3. Additional Strategies (1-3 points)",null,"Y",null,"M",null,"V",null,"HM",{"$f":"C31","v":"Option 3. Additional Strategies (1-3 points)"}]
[null,null,"Exemplary Performance: 1-2 points",null,null,null,null,null,null,null,"HM"]
[]
[null,null,null,null,null,null,null,null,null,null,"HM"]
[null,null,null,null,null,"Strategy",null,null,null,null,"HM",null,null,null,null,"Verify that all components listed in USGBC-approved Innovation request are installed; OR Verify that all components listed in USGBC-approved pilot credit are installed."]
[null,null,null,null,null,"Credit name ",null,null,null,null,"HM"]
[null,null,null,null,null,null,null,null,null,null,"HM"]
[null,null,null,null,null,"Strategy",null,null,null,null,"HM",null,null,null,null,"Verify that all components listed in USGBC-approved Innovation request are installed; OR Verify that all components listed in USGBC-approved pilot credit are installed."]
[null,null,null,null,null,"Credit name ",null,null,null,null,"HM"]
[null,null,null,null,null,null,null,null,null,null,"HM"]
[null,null,null,null,null,"Strategy",null,null,null,null,"HM",null,null,null,null,"Verify that all components listed in USGBC-approved Innovation request are installed; OR Verify that all components listed in USGBC-approved pilot credit are installed."]
[null,null,null,null,null,"Credit name ",null,null,null,null,"HM"]
[null,null,null,null,null,null,null,null,null,null,"HM"]
[null,null,null,null,null,"Strategy",null,null,null,null,"HM",null,null,null,null,"Verify that all components listed in USGBC-approved Innovation request are installed; OR Verify that all components listed in USGBC-approved pilot credit are installed."]
[null,null,null,null,null,"Credit name ",null,null,null,null,"HM"]
[null,null,null,null,null,null,null,null,null,null,"HM"]
["INc2",{"$f":"L47","v":"IN Credit LEED Accredited Professional"},null,null,null,null,null,null,null,null,"HM","IN Credit LEED Accredited Professional"]
[null,null,null,null,null,null,null,null,null,null,"HM"]
[null,"1 point",null,null,"Preliminary    Y",0,"M",0,"Verified",0,"HM",null,"Responsible Party"]
[null,null,null,null,null,null,null,null,null,null,"HM"]
[null,null,null,null,null,null,null,null,null,null,"HM"]
[null,null,null,null,null,"Name of credential holder",null,null,null,null,"HM",null,null,null,null,"Verify that principal member of project team is LEED AP Homes."]

{"sheet":"RP","index":16,"n_rows":19,"n_cols":17,"rows_kept":19,"cut":false,"hidden":false,"merged":[[4,1,4,3],[9,2,9,9],[17,2,17,3],[18,2,18,3],[14,2,14,3],[15,2,15,3],[10,2,10,3],[11,2,11,3],[12,2,12,3],[13,2,13,3],[16,2,16,3]]}
[null,"Regional Priority",null,null,null,null,null,null,null,null,null,"Notes","Verified \n(initials)","Date \nVerified","QAD Notes","Verification Measure","QAD \nVerification Notes"]
[]
[null,null,null,null,"Preliminary    Y",{"$f":"F7","v":0},"Maybe",{"$f":"H7","v":0},"Verified",{"$f":"J7","v":0}]
[]
["RPc1",{"$f":"L5","v":"RP Credit Regional Priority"},null,null,null,null,null,null,null,null,"HM","RP Credit Regional Priority"]
[null,null,null,null,null,null,null,null,null,null,"HM"]
[null,"Up to 4 points",null,null,"Preliminary    Y",0,"M",0,"Verified",0,"HM",null,"Responsible Party"]
[null,null,null,null,null,null,null,null,null,null,"HM"]
[null,null,null,null,null,null,null,null,null,null,"HM"]
[null,null,"Regional priority credits may be found on www.usgbc.org/rpc. Alternative Regional Priority Credits can be used if justification is provided.",null,null,null,null,null,null,null,"HM"]
[null,null,"Regional Priority Credit Name",null,"Point Threshold"]
[null,null,null,null,null,null,null,null,null,null,"HM"]
[null,null,null,null,null,null,null,null,null,null,"HM"]
[null,null,null,null,null,null,null,null,null,null,"HM"]
[null,null,null,null,null,null,null,null,null,null,"HM"]
[null,null,null,null,null,null,null,null,null,null,"HM"]
[null,null,null,null,null,null,null,null,null,null,"HM"]
[null,null,null,null,null,null,null,null,null,null,"HM"]
[null,null,null,null,null,null,null,null,null,null,"HM"]

{"sheet":"Water Reduction Calculator","index":17,"n_rows":150,"n_cols":23,"rows_kept":150,"cut":false,"hidden":false,"merged":[[132,1,132,5],[127,1,127,5],[128,1,128,5],[129,1,129,5],[130,1,130,5],[131,1,131,5],[96,1,96,4],[143,9,143,10],[143,5,143,8],[143,1,144,1],[143,2,144,4],[144,7,144,8],[144,5,144,6],[136,1,136,5],[137,1,137,5],[138,1,138,5],[139,1,139,5],[140,1,140,7],[115,1,115,4],[116,1,117,1],[116,2,117,2],[116,4,117,4],[108,1,108,2],[116,3,117,3],[54,21,55,21],[54,4,55,4],[54,18,55,18],[54,17,55,17],[4,1,4,8],[9,1,9,7],[10,1,10,7],[8,1,8,7],[35,1,35,4],[54,2,55,2],[13,1,13,3],[25,1,25,3],[27,1,27,2],[34,1,34,4],[36,21,37,21],[36,4,37,4],[36,14,37,14],[36,15,37,15],[36,16,37,16],[36,17,37,17],[36,18,37,18],[36,19,37,19],[36,5,36,6],[7,1,7,8],[97,1,98,1],[97,2,98,2],[97,4,98,4],[97,3,98,3],[78,1,79,1],[78,2,79,2],[89,1,89,2],[36,13,37,13],[77,1,77,4],[54,1,55,1],[78,3,79,3],[54,3,55,3],[36,2,37,2],[36,7,36,8],[36,9,36,10],[36,11,36,12],[78,21,79,21],[78,4,79,4],[66,1,66,4],[116,18,117,18],[116,19,117,19],[35,18,35,19],[35,15,35,17],[53,1,53,4],[53,5,53,14],[54,5,54,6],[54,7,54,8],[54,9,54,10],[54,11,54,12],[54,13,55,13],[53,15,53,17],[53,18,53,19],[36,1,37,1],[36,3,37,3],[96,15,96,17],[96,18,96,19],[97,18,98,18],[97,19,98,19],[97,15,98,15],[97,16,98,16],[97,21,98,21],[97,17,98,17],[97,13,98,13],[97,14,98,14],[97,5,97,6],[97,7,97,8],[97,9,97,10],[97,11,97,12],[116,21,117,21],[115,15,115,17],[116,5,116,6],[116,7,116,8],[116,9,116,10],[116,11,116,12],[116,15,117,15],[116,16,117,16],[116,17,117,17],[116,13,117,13],[116,14,117,14],[115,18,115,19],[54,16,55,16],[54,19,55,19],[54,15,55,15],[54,14,55,14],[78,14,79,14],[78,15,79,15],[78,5,78,6],[78,7,78,8],[78,9,78,10],[78,11,78,12],[78,13,79,13],[77,15,77,17],[78,19,79,19],[78,16,79,16],[78,17,79,17],[78,18,79,18],[77,18,77,19]]}
[]
[null,"Water Reduction Calculator"]
[]
[]
[null,"Use this calculator to determine if your building uses less water than the requirements of  WE Credit Total Water Use.\n\nNote:  This calculator is a relative measure of water use based on how the products are designed and not how they actually perform in the field.  Therefore, please use values/rates from the product specifications.  Measurements from field testing should NOT be used in this calculator, but may be used to identify improperly installed or malfunctioning products.  "]
[]
[null,"Outdoor Water Use"]
[null,"Provide the following values from the WaterSense Water Budget Calculator. Note that you should enter the ‘Baseline’ water use, not the Landscape Water Allowance. The landscape water allowance is by definition 70% of the baseline water use."]
[null,{"$f":"CONCATENATE(\"Baseline for the site\",IF(Instructions!$I$85=1,\" (gal/peak month)\",\" (l/peak month)\"))","v":"Baseline for the site (gal/peak month)"}]
[null,{"$f":"CONCATENATE(\"Landscape water requirement for site\",IF(Instructions!$I$85=1,\" (gal/peak month)\",\" (l/peak month)\"))","v":"Landscape water requirement for site (gal/peak month)"}]
[null,{"$f":"CONCATENATE(\"Rainwater or graywater\",IF(Instructions!$I$85=1,\" (gal/peak month)\",\" (l/peak month)\"))","v":"Rainwater or graywater (gal/peak month)"}]
[]
[null,"Unit Information"]
[null,"List the number of each type of unit for the building. This information is used to double check your entries for each fixture type.  For single family homes, put  '1' by the number of bedrooms."]
[null,"Unit Type","Number of \nUnits","Occupants",null,null,null,null,null,null,null,null,null,null,null,null,null,null,null,null,null,"Number of Bedrooms","All units"]
[{"$f":"IF(B16>0,0,0)","v":0},"Efficiency",null,{"$f":"(1+1)*C16","v":0},null,null,null,null,null,null,null,null,null,null,null,null,null,null,null,null,null,1,"Efficiency"]
[{"$f":"IF(B17>0,0,0)","v":0},"1 Bedroom",null,{"$f":"(1+1)*C17","v":0},null,null,null,null,null,null,null,null,null,null,null,null,null,null,null,null,null,1,"1 Bedroom"]
[{"$f":"IF(B18>0,0,0)","v":0},"2 Bedrooms",null,{"$f":"(2+1)*C18","v":0},null,null,null,null,null,null,null,null,null,null,null,null,null,null,null,null,null,2,"2 Bedrooms"]
[{"$f":"IF(B19>0,0,0)","v":0},"3 Bedrooms",null,{"$f":"(3+1)*C19","v":0},null,null,null,null,null,null,null,null,null,null,null,null,null,null,null,null,null,3,"3 Bedrooms"]
[0,"4 Bedrooms",null,{"$f":"(4+1)*C20","v":0},null,null,null,null,null,null,null,null,null,null,null,null,null,null,null,null,null,4,"4 Bedrooms"]
[null,"5 Bedrooms",null,{"$f":"(5+1)*C21","v":0},null,null,null,null,null,null,null,null,null,null,null,null,null,null,null,null,null,5,"5 Bedrooms"]
[null,"6 Bedrooms",null,{"$f":"(6+1)*C22","v":0},null,null,null,null,null,null,null,null,null,null,null,null,null,null,null,null,null,6,"6 Bedrooms"]
[null,"Totals",{"$f":"SUM(C16:C22)","v":0},{"$f":"SUM(D16:D22)","v":0}]
["A"]
[null,"Indoor Water Use"]
[null,"This section determines the average flow rate of each fixture, for each unique unit type which is used to calculate the average indoor water use for each unit's occupants."]
[null,"Fixture Use for Showers"]
[null,"Enter the flow rate and a brief description for each type of fixture."]
[null,"Fixture ID",{"$f":"CONCATENATE(\"Flow Rate\n\",IF(Instructions!$I$85=1,\"(gpm)\",\"(lpm)\"))","v":"Flow Rate\n(gpm)"},"TSV?",{"$f":"CONCATENATE(\"Adjusted Flow Rate\n\",IF(Instructions!$I$85=1,\"(gpm)\",\"(lpm)\"))","v":"Adjusted Flow Rate\n(gpm)"}]
[{"$f":"IF(B30>0,0,0)","v":0},null,null,null,{"$f":"IFERROR(IF(C30=\"\",\"\",IF(D30=\"Yes\",C30*($C$146-(30/60))/$C$146,C30)),0)","v":""}]
[{"$f":"IF(B31>0,0,0)","v":0},null,null,null,{"$f":"IFERROR(IF(C31=\"\",\"\",IF(D31=\"Yes\",C31*($C$146-(30/60))/$C$146,C31)),0)","v":""}]
[{"$f":"IF(B32>0,0,0)","v":0},null,null,null,""]
[null,null,null,null,""]
[]
[null,"Complete one row for each unique set of units and enter each fixture's information. This will calculate the average water use of the occupant of each unit type. If the fixture is the same throughout the building, select 'All units' under 'Unit Type' and select the appropriate fixture in Fixture 1."]
[null,"Unit Information",null,null,null,"Design",null,null,null,null,null,null,null,null,null,"Baseline",null,null,"Totals"]
[null,"Unit Type","Unit \nDescription","Number of \nUnits","Occupants","Fixture 1",null,"Fixture 2",null,"Fixture 3",null,"Fixture 4",null,{"$f":"CONCATENATE(\"Average \nFlow Rate\n\",IF(Instructions!$I$85=1,\"(gpm)\",\"(lpm)\"))","v":"Average \nFlow Rate\n(gpm)"},{"$f":"CONCATENATE(\"Calculated\nWater Usage\n\",IF(Instructions!$I$85=1,\" (gallons)\",\" (liters)\"))","v":"Calculated\nWater Usage\n (gallons)"},"Estimated Fixture Usage\n(minutes)",{"$f":"CONCATENATE(\"Flow Rate\n\",IF(Instructions!$I$85=1,\"(gpm)\",\"(lpm)\"))","v":"Flow Rate\n(gpm)"},{"$f":"CONCATENATE(\"Estimated\nWater Usage\n\",IF(Instructions!$I$85=1,\" (gallons)\",\" (liters)\"))","v":"Estimated\nWater Usage\n (gallons)"},{"$f":"CONCATENATE(\"Design \nMonthly \nWater Use\n\",IF(Instructions!$I$85=1,\" (gal/month)\",\" (l/month)\"))","v":"Design \nMonthly \nWater Use\n (gal/month)"},{"$f":"CONCATENATE(\"Baseline Monthly \nWater Use\n\",IF(Instructions!$I$85=1,\" (gal/month)\",\" (l/month)\"))","v":"Baseline Monthly \nWater Use\n (gal/month)"},null,"Number of Bedrooms"]
[null,null,null,null,null,"Fixture 1 \nID",{"$f":"CONCATENATE(\"Fixture 1 \nFlow Rate\n\",IF(Instructions!$I$85=1,\"(gpm)\",\"(lpm)\"))","v":"Fixture 1 \nFlow Rate\n(gpm)"},"Fixture 2\nID",{"$f":"CONCATENATE(\"Fixture 2 \nFlow Rate\n\",IF(Instructions!$I$85=1,\"(gpm)\",\"(lpm)\"))","v":"Fixture 2 \nFlow Rate\n(gpm)"},"Fixture 3\nID",{"$f":"CONCATENATE(\"Fixture 3 \nFlow Rate\n\",IF(Instructions!$I$85=1,\"(gpm)\",\"(lpm)\"))","v":"Fixture 3 \nFlow Rate\n(gpm)"},"Fixture 4\nID",{"$f":"CONCATENATE(\"Fixture 4 \nFlow Rate\n\",IF(Instructions!$I$85=1,\"(gpm)\",\"(lpm)\"))","v":"Fixture 4 \nFlow Rate\n(gpm)"}]
[{"$f":"IF(B39>0,0,0)","v":0},null,null,null,{"$f":"IFERROR(IF(B39=\"All units\",$D$23,(V39+1)*D39),0)","v":0},null,{"$f":"IFERROR(VLOOKUP(F39,$B$30:$E$33,4,FALSE),\"\")","v":""},null,{"$f":"IFERROR(VLOOKUP(H39,$B$30:$E$33,4,FALSE),\"\")","v":""},null,{"$f":"IFERROR(VLOOKUP(J39,$B$30:$E$33,4,FALSE),\"\")","v":""},null,{"$f":"IFERROR(VLOOKUP(L39,$B$30:$E$33,4,FALSE),\"\")","v":""},{"$f":"IFERROR(SUM(G39,I39,K39,M39)/COUNTA(F39,H39,J39,L39),\"\")","v":""},{"$f":"IFERROR(N39*$P39,\"\")","v":""},{"$f":"IF(B39<>\"\",$C$146,\"\")","v":""},{"$f":"IF(B39<>\"\",IF(Instructions!$I$85=1,$F$146,$H$146),\"\")","v":""},{"$f":"IF(B39<>\"\",IF(Instructions!$I$85=1,$J$146,$K$146),\"\")","v":""},{"$f":"IFERROR(O39*30*$E39,\"\")","v":""},{"$f":"IFERROR(R39*30*$E39,\"\")","v":""},null,{"$f":"IFERROR(VLOOKUP(B39,$B$16:$V$22,21,FALSE),\"\")","v":""}]
[{"$f":"IF(B40>0,0,0)","v":0},null,null,null,{"$f":"IFERROR(IF(B40=\"All units\",$D$23,(V40+1)*D40),0)","v":0},null,{"$f":"IFERROR(VLOOKUP(F40,$B$30:$E$33,4,FALSE),\"\")","v":""},null,{"$f":"IFERROR(VLOOKUP(H40,$B$30:$E$33,4,FALSE),\"\")","v":""},null,{"$f":"IFERROR(VLOOKUP(J40,$B$30:$E$33,4,FALSE),\"\")","v":""},null,{"$f":"IFERROR(VLOOKUP(L40,$B$30:$E$33,4,FALSE),\"\")","v":""},{"$f":"IFERROR(SUM(G40,I40,K40,M40)/COUNTA(F40,H40,J40,L40),\"\")","v":""},{"$f":"IFERROR(N40*$P40,\"\")","v":""},{"$f":"IF(B40<>\"\",$C$146,\"\")","v":""},{"$f":"IF(B40<>\"\",IF(Instructions!$I$85=1,$F$146,$H$146),\"\")","v":""},{"$f":"IF(B40<>\"\",IF(Instructions!$I$85=1,$J$146,$K$146),\"\")","v":""},{"$f":"IFERROR(O40*30*$E40,\"\")","v":""},{"$f":"IFERROR(R40*30*$E40,\"\")","v":""},null,{"$f":"IFERROR(VLOOKUP(B40,$B$16:$V$22,21,FALSE),\"\")","v":""}]
[{"$f":"IF(B41>0,0,0)","v":0},null,null,null,{"$f":"IFERROR(IF(B41=\"All units\",$D$23,(V41+1)*D41),0)","v":0},null,{"$f":"IFERROR(VLOOKUP(F41,$B$30:$E$33,4,FALSE),\"\")","v":""},null,{"$f":"IFERROR(VLOOKUP(H41,$B$30:$E$33,4,FALSE),\"\")","v":""},null,{"$f":"IFERROR(VLOOKUP(J41,$B$30:$E$33,4,FALSE),\"\")","v":""},null,{"$f":"IFERROR(VLOOKUP(L41,$B$30:$E$33,4,FALSE),\"\")","v":""},"",{"$f":"IFERROR(N41*$P41,\"\")","v":""},{"$f":"IF(B41<>\"\",$C$146,\"\")","v":""},{"$f":"IF(B41<>\"\",IF(Instructions!$I$85=1,$F$146,$H$146),\"\")","v":""},{"$f":"IF(B41<>\"\",IF(Instructions!$I$85=1,$J$146,$K$146),\"\")","v":""},{"$f":"IFERROR(O41*30*$E41,\"\")","v":""},{"$f":"IFERROR(R41*30*$E41,\"\")","v":""},null,{"$f":"IFERROR(VLOOKUP(B41,$B$16:$V$22,21,FALSE),\"\")","v":""}]
[null,null,null,null,{"$f":"IFERROR(IF(B42=\"All units\",$D$23,(V42+1)*D42),0)","v":0},null,{"$f":"IFERROR(VLOOKUP(F42,$B$30:$E$33,4,FALSE),\"\")","v":""},null,{"$f":"IFERROR(VLOOKUP(H42,$B$30:$E$33,4,FALSE),\"\")","v":""},null,{"$f":"IFERROR(VLOOKUP(J42,$B$30:$E$33,4,FALSE),\"\")","v":""},null,{"$f":"IFERROR(VLOOKUP(L42,$B$30:$E$33,4,FALSE),\"\")","v":""},"",{"$f":"IFERROR(N42*$P42,\"\")","v":""},{"$f":"IF(B42<>\"\",$C$146,\"\")","v":""},{"$f":"IF(B42<>\"\",IF(Instructions!$I$85=1,$F$146,$H$146),\"\")","v":""},{"$f":"IF(B42<>\"\",IF(Instructions!$I$85=1,$J$146,$K$146),\"\")","v":""},{"$f":"IFERROR(O42*30*$E42,\"\")","v":""},{"$f":"IFERROR(R42*30*$E42,\"\")","v":""},null,{"$f":"IFERROR(VLOOKUP(B42,$B$16:$V$22,21,FALSE),\"\")","v":""}]
[null,null,null,null,{"$f":"IFERROR(IF(B43=\"All units\",$D$23,(V43+1)*D43),0)","v":0},null,{"$f":"IFERROR(VLOOKUP(F43,$B$30:$E$33,4,FALSE),\"\")","v":""},null,{"$f":"IFERROR(VLOOKUP(H43,$B$30:$E$33,4,FALSE),\"\")","v":""},null,{"$f":"IFERROR(VLOOKUP(J43,$B$30:$E$33,4,FALSE),\"\")","v":""},null,{"$f":"IFERROR(VLOOKUP(L43,$B$30:$E$33,4,FALSE),\"\")","v":""},"",{"$f":"IFERROR(N43*$P43,\"\")","v":""},{"$f":"IF(B43<>\"\",$C$146,\"\")","v":""},{"$f":"IF(B43<>\"\",IF(Instructions!$I$85=1,$F$146,$H$146),\"\")","v":""},{"$f":"IF(B43<>\"\",IF(Instructions!$I$85=1,$J$146,$K$146),\"\")","v":""},{"$f":"IFERROR(O43*30*$E43,\"\")","v":""},{"$f":"IFERROR(R43*30*$E43,\"\")","v":""},null,{"$f":"IFERROR(VLOOKUP(B43,$B$16:$V$22,21,FALSE),\"\")","v":""}]
["B","Totals for showers",null,{"$f":"SUM(D39:D43)","v":0},{"$f":"SUM(E39:E43)","v":0},null,null,null,null,null,null,null,null,null,null,null,null,null,{"$f":"SUM(S39:S43)","v":0},{"$f":"SUM(T39:T43)","v":0}]
[]
[]
[null,"Fixture Use for Lavatories and Kitchen Faucets"]
[null,"Fixture ID",{"$f":"CONCATENATE(\"Flow Rate\n\",IF(Instructions!$I$85=1,\"(gpm)\",\"(lpm)\"))","v":"Flow Rate\n(gpm)"}]
[{"$f":"IF(B49>0,0,0)","v":0}]
[{"$f":"IF(B50>0,0,0)","v":0}]
[{"$f":"IF(B51>0,0,0)","v":0}]
[]
[]
[null,"Unit Information",null,null,null,"Design",null,null,null,null,null,null,null,null,null,"Baseline",null,null,"Totals"]
[null,"Unit Type","Unit \nDescription","Number of \nUnits","Occupants","Fixture 1",null,"Fixture 2",null,"Fixture 3",null,"Fixture 4",null,{"$f":"CONCATENATE(\"Average \nFlow Rate\n\",IF(Instructions!$I$85=1,\"(gpm)\",\"(lpm)\"))","v":"Average \nFlow Rate\n(gpm)"},{"$f":"CONCATENATE(\"Calculated\nWater Usage\n\",IF(Instructions!$I$85=1,\" (gallons)\",\" (liters)\"))","v":"Calculated\nWater Usage\n (gallons)"},"Estimated Fixture Usage\n(minutes)",{"$f":"CONCATENATE(\"Flow Rate\n\",IF(Instructions!$I$85=1,\"(gpm)\",\"(lpm)\"))","v":"Flow Rate\n(gpm)"},{"$f":"CONCATENATE(\"Estimated\nWater Usage\n\",IF(Instructions!$I$85=1,\" (gallons)\",\" (liters)\"))","v":"Estimated\nWater Usage\n (gallons)"},{"$f":"CONCATENATE(\"Design\nMonthly \nWater Use\n\",IF(Instructions!$I$85=1,\" (gal/month)\",\" (l/month)\"))","v":"Design\nMonthly \nWater Use\n (gal/month)"},{"$f":"CONCATENATE(\"Baseline Monthly \nWater Use\n\",IF(Instructions!$I$85=1,\" (gal/month)\",\" (l/month)\"))","v":"Baseline Monthly \nWater Use\n (gal/month)"},null,"Number of Bedrooms"]
[null,null,null,null,null,"Fixture 1 \nID",{"$f":"CONCATENATE(\"Fixture 1 \nFlow Rate\n\",IF(Instructions!$I$85=1,\"(gpm)\",\"(lpm)\"))","v":"Fixture 1 \nFlow Rate\n(gpm)"},"Fixture 2\nID",{"$f":"CONCATENATE(\"Fixture 2 \nFlow Rate\n\",IF(Instructions!$I$85=1,\"(gpm)\",\"(lpm)\"))","v":"Fixture 2 \nFlow Rate\n(gpm)"},"Fixture 3\nID",{"$f":"CONCATENATE(\"Fixture 3 \nFlow Rate\n\",IF(Instructions!$I$85=1,\"(gpm)\",\"(lpm)\"))","v":"Fixture 3 \nFlow Rate\n(gpm)"},"Fixture 4\nID",{"$f":"CONCATENATE(\"Fixture 4 \nFlow Rate\n\",IF(Instructions!$I$85=1,\"(gpm)\",\"(lpm)\"))","v":"Fixture 4 \nFlow Rate\n(gpm)"}]
[{"$f":"IF(B57>0,0,0)","v":0},null,null,null,{"$f":"IFERROR(IF(B57=\"All units\",$D$23,(V57+1)*D57),0)","v":0},null,{"$f":"IFERROR(VLOOKUP(F57,$B$49:$C$52,2,FALSE),\"\")","v":""},null,{"$f":"IFERROR(VLOOKUP(H57,$B$49:$C$52,2,FALSE),\"\")","v":""},null,{"$f":"IFERROR(VLOOKUP(J57,$B$49:$C$52,2,FALSE),\"\")","v":""},null,{"$f":"IFERROR(VLOOKUP(L57,$B$49:$C$52,2,FALSE),\"\")","v":""},{"$f":"IFERROR(SUM(G57,I57,K57,M57)/COUNTA(F57,H57,J57,L57),\"\")","v":""},{"$f":"IFERROR(N57*$P57,\"\")","v":""},{"$f":"IF(B57<>\"\",$C$147,\"\")","v":""},{"$f":"IF(B57<>\"\",IF(Instructions!$I$85=1,$F$147,$H$147),\"\")","v":""},{"$f":"IF(B57<>\"\",IF(Instructions!$I$85=1,$J$147,$K$147),\"\")","v":""},{"$f":"IFERROR(O57*30*$E57,\"\")","v":""},{"$f":"IFERROR(R57*30*$E57,\"\")","v":""},null,{"$f":"IFERROR(VLOOKUP(B57,$B$16:$V$22,21,FALSE),\"\")","v":""}]
[{"$f":"IF(B58>0,0,0)","v":0},null,null,null,{"$f":"IFERROR(IF(B58=\"All units\",$D$23,(V58+1)*D58),0)","v":0},null,{"$f":"IFERROR(VLOOKUP(F58,$B$49:$C$52,2,FALSE),\"\")","v":""},null,"",null,{"$f":"IFERROR(VLOOKUP(J58,$B$49:$C$52,2,FALSE),\"\")","v":""},null,{"$f":"IFERROR(VLOOKUP(L58,$B$49:$C$52,2,FALSE),\"\")","v":""},{"$f":"IFERROR(SUM(G58,I58,K58,M58)/COUNTA(F58,H58,J58,L58),\"\")","v":""},{"$f":"IFERROR(N58*$P58,\"\")","v":""},{"$f":"IF(B58<>\"\",$C$147,\"\")","v":""},{"$f":"IF(B58<>\"\",IF(Instructions!$I$85=1,$F$147,$H$147),\"\")","v":""},{"$f":"IF(B58<>\"\",IF(Instructions!$I$85=1,$J$147,$K$147),\"\")","v":""},{"$f":"IFERROR(O58*30*$E58,\"\")","v":""},{"$f":"IFERROR(R58*30*$E58,\"\")","v":""},null,{"$f":"IFERROR(VLOOKUP(B58,$B$16:$V$22,21,FALSE),\"\")","v":""}]
[{"$f":"IF(B59>0,0,0)","v":0},null,null,null,{"$f":"IFERROR(IF(B59=\"All units\",$D$23,(V59+1)*D59),0)","v":0},null,"",null,"",null,{"$f":"IFERROR(VLOOKUP(J59,$B$49:$C$52,2,FALSE),\"\")","v":""},null,{"$f":"IFERROR(VLOOKUP(L59,$B$49:$C$52,2,FALSE),\"\")","v":""},"",{"$f":"IFERROR(N59*$P59,\"\")","v":""},{"$f":"IF(B59<>\"\",$C$147,\"\")","v":""},{"$f":"IF(B59<>\"\",IF(Instructions!$I$85=1,$F$147,$H$147),\"\")","v":""},{"$f":"IF(B59<>\"\",IF(Instructions!$I$85=1,$J$147,$K$147),\"\")","v":""},{"$f":"IFERROR(O59*30*$E59,\"\")","v":""},{"$f":"IFERROR(R59*30*$E59,\"\")","v":""},null,{"$f":"IFERROR(VLOOKUP(B59,$B$16:$V$22,21,FALSE),\"\")","v":""}]
[null,null,null,null,{"$f":"IFERROR(IF(B60=\"All units\",$D$23,(V60+1)*D60),0)","v":0},null,"",null,"",null,{"$f":"IFERROR(VLOOKUP(J60,$B$49:$C$52,2,FALSE),\"\")","v":""},null,{"$f":"IFERROR(VLOOKUP(L60,$B$49:$C$52,2,FALSE),\"\")","v":""},"",{"$f":"IFERROR(N60*$P60,\"\")","v":""},{"$f":"IF(B60<>\"\",$C$147,\"\")","v":""},{"$f":"IF(B60<>\"\",IF(Instructions!$I$85=1,$F$147,$H$147),\"\")","v":""},{"$f":"IF(B60<>\"\",IF(Instructions!$I$85=1,$J$147,$K$147),\"\")","v":""},{"$f":"IFERROR(O60*30*$E60,\"\")","v":""},{"$f":"IFERROR(R60*30*$E60,\"\")","v":""},null,{"$f":"IFERROR(VLOOKUP(B60,$B$16:$V$22,21,FALSE),\"\")","v":""}]
[null,null,null,null,{"$f":"IFERROR(IF(B61=\"All units\",$D$23,(V61+1)*D61),0)","v":0},null,"",null,"",null,{"$f":"IFERROR(VLOOKUP(J61,$B$49:$C$52,2,FALSE),\"\")","v":""},null,{"$f":"IFERROR(VLOOKUP(L61,$B$49:$C$52,2,FALSE),\"\")","v":""},"",{"$f":"IFERROR(N61*$P61,\"\")","v":""},{"$f":"IF(B61<>\"\",$C$147,\"\")","v":""},{"$f":"IF(B61<>\"\",IF(Instructions!$I$85=1,$F$147,$H$147),\"\")","v":""},{"$f":"IF(B61<>\"\",IF(Instructions!$I$85=1,$J$147,$K$147),\"\")","v":""},{"$f":"IFERROR(O61*30*$E61,\"\")","v":""},{"$f":"IFERROR(R61*30*$E61,\"\")","v":""},null,{"$f":"IFERROR(VLOOKUP(B61,$B$16:$V$22,21,FALSE),\"\")","v":""}]
["C","Totals for lavs and kitchen faucets",null,{"$f":"SUM(D57:D61)","v":0},{"$f":"SUM(E57:E61)","v":0},null,null,null,null,null,null,null,null,null,null,null,null,null,{"$f":"SUM(S57:S61)","v":0},{"$f":"SUM(T57:T61)","v":0}]
[]
[]
[null,"Fixture Use for Toilets"]
[]
[null,"For projects with dual-flush toilets\nCalculate the average flush rate below and enter the resulting flush rate into the design case flush rate section for toilet."]
[null,{"$f":"CONCATENATE(\"High flush rate\",IF(Instructions!$I$85=1,\" (gpf)\",\" (lpf)\"))","v":"High flush rate (gpf)"}]
[null,{"$f":"CONCATENATE(\"Low flush rate\",IF(Instructions!$I$85=1,\" (gpf)\",\" (lpf)\"))","v":"Low flush rate (gpf)"}]
[null,{"$f":"CONCATENATE(\"Average flush rate\",IF(Instructions!$I$85=1,\" (gpf)\",\" (lpf)\"))","v":"Average flush rate (gpf)"},null,null,{"$f":"IFERROR((2*E69+E68)/3,0)","v":0}]
[]
[null,"Fixture ID",{"$f":"CONCATENATE(\"Flush Rate\n\",IF(Instructions!$I$85=1,\"(gpf)\",\"(lpf)\"))","v":"Flush Rate\n(gpf)"}]
[{"$f":"IF(B73>0,0,0)","v":0}]
[{"$f":"IF(B74>0,0,0)","v":0}]
[{"$f":"IF(B75>0,0,0)","v":0}]
[]
[]
[null,"Unit Information",null,null,null,"Design",null,null,null,null,null,null,null,null,null,"Baseline",null,null,"Totals"]
[null,"Unit Type","Unit \nDescription","Number of \nUnits","Occupants","Fixture 1",null,"Fixture 2",null,"Fixture 3",null,"Fixture 4",null,{"$f":"CONCATENATE(\"Average\nFlush Rate\n\",IF(Instructions!$I$85=1,\"(gpf)\",\"(lpf)\"))","v":"Average\nFlush Rate\n(gpf)"},{"$f":"CONCATENATE(\"Calculated\nWater Usage\n\",IF(Instructions!$I$85=1,\" (gallons)\",\" (liters)\"))","v":"Calculated\nWater Usage\n (gallons)"},"Estimated Fixture Usage\n(flushes)",{"$f":"CONCATENATE(\"Flush Rate\n\",IF(Instructions!$I$85=1,\"(gpf)\",\"(lpf)\"))","v":"Flush Rate\n(gpf)"},{"$f":"CONCATENATE(\"Estimated\nWater Usage\n\",IF(Instructions!$I$85=1,\" (gallons)\",\" (liters)\"))","v":"Estimated\nWater Usage\n (gallons)"},{"$f":"CONCATENATE(\"Design\nMonthly \nWater Use\n\",IF(Instructions!$I$85=1,\" (gal/month)\",\" (l/month)\"))","v":"Design\nMonthly \nWater Use\n (gal/month)"},{"$f":"CONCATENATE(\"Baseline Monthly \nWater Use\n\",IF(Instructions!$I$85=1,\" (gal/month)\",\" (l/month)\"))","v":"Baseline Monthly \nWater Use\n (gal/month)"},null,"Number of Bedrooms"]
[null,null,null,null,null,"Fixture 1 \nID",{"$f":"CONCATENATE(\"Fixture 1\nFlush Rate\n\",IF(Instructions!$I$85=1,\"(gpf)\",\"(lpf)\"))","v":"Fixture 1\nFlush Rate\n(gpf)"},"Fixture 2\nID",{"$f":"CONCATENATE(\"Fixture 2\nFlush Rate\n\",IF(Instructions!$I$85=1,\"(gpf)\",\"(lpf)\"))","v":"Fixture 2\nFlush Rate\n(gpf)"},"Fixture 3\nID",{"$f":"CONCATENATE(\"Fixture 3\nFlush Rate\n\",IF(Instructions!$I$85=1,\"(gpf)\",\"(lpf)\"))","v":"Fixture 3\nFlush Rate\n(gpf)"},"Fixture 4\nID",{"$f":"CONCATENATE(\"Fixture 4\nFlush Rate\n\",IF(Instructions!$I$85=1,\"(gpf)\",\"(lpf)\"))","v":"Fixture 4\nFlush Rate\n(gpf)"}]
[{"$f":"IF(B81>0,0,0)","v":0},null,null,null,{"$f":"IFERROR(IF(B81=\"All units\",$D$23,(V81+1)*D81),0)","v":0},null,{"$f":"IFERROR(VLOOKUP(F81,$B$73:$C$76,2,FALSE),\"\")","v":""},null,{"$f":"IFERROR(VLOOKUP(H81,$B$73:$C$76,2,FALSE),\"\")","v":""},null,{"$f":"IFERROR(VLOOKUP(J81,$B$73:$C$76,2,FALSE),\"\")","v":""},null,{"$f":"IFERROR(VLOOKUP(L81,$B$73:$C$76,2,FALSE),\"\")","v":""},{"$f":"IFERROR(SUM(G81,I81,K81,M81)/COUNTA(F81,H81,J81,L81),\"\")","v":""},{"$f":"IFERROR(N81*$P81,\"\")","v":""},{"$f":"IF(B81<>\"\",$C$148,\"\")","v":""},{"$f":"IF(B81<>\"\",IF(Instructions!$I$85=1,$F$148,$H$148),\"\")","v":""},{"$f":"IF(B81<>\"\",IF(Instructions!$I$85=1,$J$148,$K$148),\"\")","v":""},{"$f":"IFERROR(O81*30*$E81,\"\")","v":""},{"$f":"IFERROR(R81*30*$E81,\"\")","v":""},null,{"$f":"IFERROR(VLOOKUP(B81,$B$16:$V$22,21,FALSE),\"\")","v":""}]
[{"$f":"IF(B82>0,0,0)","v":0},null,null,null,{"$f":"IFERROR(IF(B82=\"All units\",$D$23,(V82+1)*D82),0)","v":0},null,"",null,"",null,{"$f":"IFERROR(VLOOKUP(J82,$B$73:$C$76,2,FALSE),\"\")","v":""},null,{"$f":"IFERROR(VLOOKUP(L82,$B$73:$C$76,2,FALSE),\"\")","v":""},{"$f":"IFERROR(SUM(G82,I82,K82,M82)/COUNTA(F82,H82,J82,L82),\"\")","v":""},{"$f":"IFERROR(N82*$P82,\"\")","v":""},{"$f":"IF(B82<>\"\",$C$148,\"\")","v":""},{"$f":"IF(B82<>\"\",IF(Instructions!$I$85=1,$F$148,$H$148),\"\")","v":""},{"$f":"IF(B82<>\"\",IF(Instructions!$I$85=1,$J$148,$K$148),\"\")","v":""},{"$f":"IFERROR(O82*30*$E82,\"\")","v":""},{"$f":"IFERROR(R82*30*$E82,\"\")","v":""},null,{"$f":"IFERROR(VLOOKUP(B82,$B$16:$V$22,21,FALSE),\"\")","v":""}]
[{"$f":"IF(B83>0,0,0)","v":0},null,null,null,{"$f":"IFERROR(IF(B83=\"All units\",$D$23,(V83+1)*D83),0)","v":0},null,"",null,"",null,{"$f":"IFERROR(VLOOKUP(J83,$B$73:$C$76,2,FALSE),\"\")","v":""},null,{"$f":"IFERROR(VLOOKUP(L83,$B$73:$C$76,2,FALSE),\"\")","v":""},"",{"$f":"IFERROR(N83*$P83,\"\")","v":""},{"$f":"IF(B83<>\"\",$C$148,\"\")","v":""},{"$f":"IF(B83<>\"\",IF(Instructions!$I$85=1,$F$148,$H$148),\"\")","v":""},{"$f":"IF(B83<>\"\",IF(Instructions!$I$85=1,$J$148,$K$148),\"\")","v":""},{"$f":"IFERROR(O83*30*$E83,\"\")","v":""},{"$f":"IFERROR(R83*30*$E83,\"\")","v":""},null,{"$f":"IFERROR(VLOOKUP(B83,$B$16:$V$22,21,FALSE),\"\")","v":""}]
[null,null,null,null,{"$f":"IFERROR(IF(B84=\"All units\",$D$23,(V84+1)*D84),0)","v":0},null,"",null,"",null,{"$f":"IFERROR(VLOOKUP(J84,$B$73:$C$76,2,FALSE),\"\")","v":""},null,{"$f":"IFERROR(VLOOKUP(L84,$B$73:$C$76,2,FALSE),\"\")","v":""},"",{"$f":"IFERROR(N84*$P84,\"\")","v":""},{"$f":"IF(B84<>\"\",$C$148,\"\")","v":""},{"$f":"IF(B84<>\"\",IF(Instructions!$I$85=1,$F$148,$H$148),\"\")","v":""},{"$f":"IF(B84<>\"\",IF(Instructions!$I$85=1,$J$148,$K$148),\"\")","v":""},{"$f":"IFERROR(O84*30*$E84,\"\")","v":""},{"$f":"IFERROR(R84*30*$E84,\"\")","v":""},null,{"$f":"IFERROR(VLOOKUP(B84,$B$16:$V$22,21,FALSE),\"\")","v":""}]
[null,null,null,null,{"$f":"IFERROR(IF(B85=\"All units\",$D$23,(V85+1)*D85),0)","v":0},null,"",null,"",null,{"$f":"IFERROR(VLOOKUP(J85,$B$73:$C$76,2,FALSE),\"\")","v":""},null,{"$f":"IFERROR(VLOOKUP(L85,$B$73:$C$76,2,FALSE),\"\")","v":""},"",{"$f":"IFERROR(N85*$P85,\"\")","v":""},{"$f":"IF(B85<>\"\",$C$148,\"\")","v":""},{"$f":"IF(B85<>\"\",IF(Instructions!$I$85=1,$F$148,$H$148),\"\")","v":""},{"$f":"IF(B85<>\"\",IF(Instructions!$I$85=1,$J$148,$K$148),\"\")","v":""},{"$f":"IFERROR(O85*30*$E85,\"\")","v":""},{"$f":"IFERROR(R85*30*$E85,\"\")","v":""},null,{"$f":"IFERROR(VLOOKUP(B85,$B$16:$V$22,21,FALSE),\"\")","v":""}]
["D","Totals for toilets",null,{"$f":"SUM(D81:D85)","v":0},{"$f":"SUM(E81:E85)","v":0},null,null,null,null,null,null,null,null,null,null,null,null,null,{"$f":"SUM(S81:S85)","v":0},{"$f":"SUM(T81:T85)","v":0}]
[]
[]
[null,"Fixture Use for Clothes Washers"]
[null,"Enter the flow rate—water factor (WF) or integrated water factor (IWF)—and a brief description for each type of fixture. If no clothes washer is installed in the project, enter 'Baseline' under 'Fixture ID' and '9.5' under 'Flow Rate.'"]
[null,"Fixture ID","Flow Rate\n(WF or IWF)"]
[{"$f":"IF(B92>0,0,0)","v":0}]
[{"$f":"IF(B93>0,0,0)","v":0}]
[{"$f":"IF(B94>0,0,0)","v":0}]
[]
[]
[null,"Unit Information",null,null,null,"Design",null,null,null,null,null,null,null,null,null,"Baseline",null,null,"Totals"]
[null,"Unit Type","Unit \nDescription","Number of \nUnits","Occupants","Fixture 1",null,"Fixture 2",null,"Fixture 3",null,"Fixture 4",null,"Average \nFlow Rate\n(WF or IWF)",{"$f":"CONCATENATE(\"Calculated\nWater Usage\n\",IF(Instructions!$I$85=1,\" (gallons)\",\" (liters)\"))","v":"Calculated\nWater Usage\n (gallons)"},{"$f":"CONCATENATE(\"Estimated Fixture Usage\n(cycles \",IF(Instructions!$I$85=1,\"at 3.5 cu ft)\",\"at 0.1 cu m)\"))","v":"Estimated Fixture Usage\n(cycles at 3.5 cu ft)"},"Flow Rate\n(WF or IWF)",{"$f":"CONCATENATE(\"Estimated\nWater Usage\n\",IF(Instructions!$I$85=1,\" (gallons)\",\" (liters)\"))","v":"Estimated\nWater Usage\n (gallons)"},{"$f":"CONCATENATE(\"Design\nMonthly \nWater Use\n\",IF(Instructions!$I$85=1,\" (gal/month)\",\" (l/month)\"))","v":"Design\nMonthly \nWater Use\n (gal/month)"},{"$f":"CONCATENATE(\"Baseline\nMonthly \nWater Use\n\",IF(Instructions!$I$85=1,\" (gal/month)\",\" (l/month)\"))","v":"Baseline\nMonthly \nWater Use\n (gal/month)"},null,"Number of Bedrooms"]
[null,null,null,null,null,"Fixture 1 \nID","Fixture 1\nFlow Rate\n(WF or IWF)","Fixture 2\nID","Fixture 2\nFlow Rate\n(WF or IWF)","Fixture 3\nID","Fixture 3\nFlow Rate\n(WF or IWF)","Fixture 4\nID","Fixture 4\nFlow Rate\n(WF or IWF)"]
[{"$f":"IF(B100>0,0,0)","v":0},null,null,null,{"$f":"IFERROR(IF(B100=\"All units\",$D$23,(V100+1)*D100),0)","v":0},null,{"$f":"IFERROR(VLOOKUP(F100,$B$92:$C$95,2,FALSE),\"\")","v":""},null,{"$f":"IFERROR(VLOOKUP(H100,$B$92:$C$95,2,FALSE),\"\")","v":""},null,{"$f":"IFERROR(VLOOKUP(J100,$B$92:$C$95,2,FALSE),\"\")","v":""},null,{"$f":"IFERROR(VLOOKUP(L100,$B$92:$C$95,2,FALSE),\"\")","v":""},{"$f":"IFERROR(SUM(G100,I100,K100,M100)/COUNTA(F100,H100,J100,L100),\"\")","v":""},{"$f":"IFERROR(IF(N100=\"\",\"\",IF(Instructions!$I$85=1,(P100*N100*3.5)*1.23,((P100*N100*3.5)*1.23)*3.78)),\"\")","v":""},{"$f":"IF(B100<>\"\",$C$149,\"\")","v":""},{"$f":"IF(B100<>\"\",$F$149,\"\")","v":""},{"$f":"IF(B100<>\"\",IF(Instructions!$I$85=1,$J$149,$K$149),\"\")","v":""},{"$f":"IFERROR(O100*30*$E100,\"\")","v":""},{"$f":"IFERROR(R100*30*$E100,\"\")","v":""},null,{"$f":"IFERROR(VLOOKUP(B100,$B$16:$V$22,21,FALSE),\"\")","v":""}]
[{"$f":"IF(B101>0,0,0)","v":0},null,null,null,{"$f":"IFERROR(IF(B101=\"All units\",$D$23,(V101+1)*D101),0)","v":0},null,{"$f":"IFERROR(VLOOKUP(F101,$B$92:$C$95,2,FALSE),\"\")","v":""},null,"",null,{"$f":"IFERROR(VLOOKUP(J101,$B$92:$C$95,2,FALSE),\"\")","v":""},null,{"$f":"IFERROR(VLOOKUP(L101,$B$92:$C$95,2,FALSE),\"\")","v":""},{"$f":"IFERROR(SUM(G101,I101,K101,M101)/COUNTA(F101,H101,J101,L101),\"\")","v":""},{"$f":"IFERROR(IF(N101=\"\",\"\",IF(Instructions!$I$85=1,(P101*N101*3.5)*1.23,((P101*N101*3.5)*1.23)*3.78)),\"\")","v":""},{"$f":"IF(B101<>\"\",$C$149,\"\")","v":""},{"$f":"IF(B101<>\"\",$F$149,\"\")","v":""},{"$f":"IF(B101<>\"\",IF(Instructions!$I$85=1,$J$149,$K$149),\"\")","v":""},{"$f":"IFERROR(O101*30*$E101,\"\")","v":""},{"$f":"IFERROR(R101*30*$E101,\"\")","v":""},null,{"$f":"IFERROR(VLOOKUP(B101,$B$16:$V$22,21,FALSE),\"\")","v":""}]
[{"$f":"IF(B102>0,0,0)","v":0},null,null,null,{"$f":"IFERROR(IF(B102=\"All units\",$D$23,(V102+1)*D102),0)","v":0},null,"",null,"",null,{"$f":"IFERROR(VLOOKUP(J102,$B$92:$C$95,2,FALSE),\"\")","v":""},null,{"$f":"IFERROR(VLOOKUP(L102,$B$92:$C$95,2,FALSE),\"\")","v":""},"",{"$f":"IFERROR(IF(N102=\"\",\"\",IF(Instructions!$I$85=1,(P102*N102*3.5)*1.23,((P102*N102*3.5)*1.23)*3.78)),\"\")","v":""},{"$f":"IF(B102<>\"\",$C$149,\"\")","v":""},{"$f":"IF(B102<>\"\",$F$149,\"\")","v":""},{"$f":"IF(B102<>\"\",IF(Instructions!$I$85=1,$J$149,$K$149),\"\")","v":""},"","",null,{"$f":"IFERROR(VLOOKUP(B102,$B$16:$V$22,21,FALSE),\"\")","v":""}]
[null,null,null,null,{"$f":"IFERROR(IF(B103=\"All units\",$D$23,(V103+1)*D103),0)","v":0},null,"",null,"",null,{"$f":"IFERROR(VLOOKUP(J103,$B$92:$C$95,2,FALSE),\"\")","v":""},null,{"$f":"IFERROR(VLOOKUP(L103,$B$92:$C$95,2,FALSE),\"\")","v":""},"",{"$f":"IFERROR(IF(N103=\"\",\"\",IF(Instructions!$I$85=1,(P103*N103*3.5)*1.23,((P103*N103*3.5)*1.23)*3.78)),\"\")","v":""},{"$f":"IF(B103<>\"\",$C$149,\"\")","v":""},{"$f":"IF(B103<>\"\",$F$149,\"\")","v":""},{"$f":"IF(B103<>\"\",IF(Instructions!$I$85=1,$J$149,$K$149),\"\")","v":""},"","",null,{"$f":"IFERROR(VLOOKUP(B103,$B$16:$V$22,21,FALSE),\"\")","v":""}]
[null,null,null,null,{"$f":"IFERROR(IF(B104=\"All units\",$D$23,(V104+1)*D104),0)","v":0},null,"",null,"",null,{"$f":"IFERROR(VLOOKUP(J104,$B$92:$C$95,2,FALSE),\"\")","v":""},null,{"$f":"IFERROR(VLOOKUP(L104,$B$92:$C$95,2,FALSE),\"\")","v":""},"",{"$f":"IFERROR(IF(N104=\"\",\"\",IF(Instructions!$I$85=1,(P104*N104*3.5)*1.23,((P104*N104*3.5)*1.23)*3.78)),\"\")","v":""},{"$f":"IF(B104<>\"\",$C$149,\"\")","v":""},{"$f":"IF(B104<>\"\",$F$149,\"\")","v":""},{"$f":"IF(B104<>\"\",IF(Instructions!$I$85=1,$J$149,$K$149),\"\")","v":""},"","",null,{"$f":"IFERROR(VLOOKUP(B104,$B$16:$V$22,21,FALSE),\"\")","v":""}]
["E","Totals for clothes washers",null,{"$f":"SUM(D100:D104)","v":0},{"$f":"SUM(E100:E104)","v":0},null,null,null,null,null,null,null,null,null,null,null,null,null,{"$f":"SUM(S100:S104)","v":0},{"$f":"SUM(T100:T104)","v":0}]
[]
[]
[null,"Fixture Use for Dishwashers"]
[null,{"$f":"CONCATENATE(\"Enter the flow rate and a brief description for each type of fixture. If no dishwasher is installed in the project, enter 'Baseline' under 'Fixture ID', and '\",IF(Instructions!$I$85=1,\"'6.5' under 'Flow Rate'.\",\"3 under 'Flow Rate'.\"))","v":"Enter the flow rate and a brief description for each type of fixture. If no dishwasher is installed in the project, enter 'Baseline' under 'Fixture ID', and ''6.5' under 'Flow Rate'."}]
[null,"Fixture ID",{"$f":"CONCATENATE(\"Flow Rate\n\",IF(Instructions!$I$85=1,\"(gpc)\",\"(lpc)\"))","v":"Flow Rate\n(gpc)"}]
[{"$f":"IF(B111>0,0,0)","v":0}]
[{"$f":"IF(B112>0,0,0)","v":0}]
[{"$f":"IF(B113>0,0,0)","v":0}]
[]
[]
[null,"Unit Information",null,null,null,"Design",null,null,null,null,null,null,null,null,null,"Baseline",null,null,"Totals"]
[null,"Unit Type","Unit \nDescription","Number of \nUnits","Occupants","Fixture 1",null,"Fixture 2",null,"Fixture 3",null,"Fixture 4",null,{"$f":"CONCATENATE(\"Average \nFlow Rate\n\",IF(Instructions!$I$85=1,\"(gpc)\",\"(lpc)\"))","v":"Average \nFlow Rate\n(gpc)"},{"$f":"CONCATENATE(\"Calculated\nWater Usage\n\",IF(Instructions!$I$85=1,\" (gallons)\",\" (liters)\"))","v":"Calculated\nWater Usage\n (gallons)"},"Estimated Fixture Usage\n(cycles)",{"$f":"CONCATENATE(\"Flow Rate\n\",IF(Instructions!$I$85=1,\"(gpc)\",\"(lpc)\"))","v":"Flow Rate\n(gpc)"},{"$f":"CONCATENATE(\"Estimated\nWater Usage\n\",IF(Instructions!$I$85=1,\" (gallons)\",\" (liters)\"))","v":"Estimated\nWater Usage\n (gallons)"},{"$f":"CONCATENATE(\"Design\nMonthly \nWater Use\n\",IF(Instructions!$I$85=1,\" (gal/month)\",\" (l/month)\"))","v":"Design\nMonthly \nWater Use\n (gal/month)"},{"$f":"CONCATENATE(\"Baseline\nMonthly \nWater Use\n\",IF(Instructions!$I$85=1,\" (gal/month)\",\" (l/month)\"))","v":"Baseline\nMonthly \nWater Use\n (gal/month)"},null,"Number of Bedrooms"]
[null,null,null,null,null,"Fixture 1 \nID",{"$f":"CONCATENATE(\"Fixture 1\nFlow Rate\n\",IF(Instructions!$I$85=1,\"(gpc)\",\"(lpc)\"))","v":"Fixture 1\nFlow Rate\n(gpc)"},"Fixture 2\nID",{"$f":"CONCATENATE(\"Fixture 2\nFlow Rate\n\",IF(Instructions!$I$85=1,\"(gpc)\",\"(lpc)\"))","v":"Fixture 2\nFlow Rate\n(gpc)"},"Fixture 3\nID",{"$f":"CONCATENATE(\"Fixture 3\nFlow Rate\n\",IF(Instructions!$I$85=1,\"(gpc)\",\"(lpc)\"))","v":"Fixture 3\nFlow Rate\n(gpc)"},"Fixture 4\nID",{"$f":"CONCATENATE(\"Fixture 4\nFlow Rate\n\",IF(Instructions!$I$85=1,\"(gpc)\",\"(lpc)\"))","v":"Fixture 4\nFlow Rate\n(gpc)"}]
[{"$f":"IF(B119>0,0,0)","v":0},null,null,null,{"$f":"IFERROR(IF(B119=\"All units\",$D$23,(V119+1)*D119),0)","v":0},null,{"$f":"IFERROR(VLOOKUP(F119,$B$111:$C$114,2,FALSE),\"\")","v":""},null,{"$f":"IFERROR(VLOOKUP(H119,$B$111:$C$114,2,FALSE),\"\")","v":""},null,{"$f":"IFERROR(VLOOKUP(J119,$B$111:$C$114,2,FALSE),\"\")","v":""},null,{"$f":"IFERROR(VLOOKUP(L119,$B$111:$C$114,2,FALSE),\"\")","v":""},{"$f":"IFERROR(SUM(G119,I119,K119,M119)/COUNTA(F119,H119,J119,L119),\"\")","v":""},{"$f":"IFERROR(N119*$P119,\"\")","v":""},{"$f":"IF(B119<>\"\",$C$150,\"\")","v":""},{"$f":"IF(B119<>\"\",IF(Instructions!$I$85=1,$F$150,$H$150),\"\")","v":""},{"$f":"IF(B119<>\"\",IF(Instructions!$I$85=1,$J$150,$K$150),\"\")","v":""},{"$f":"IFERROR(O119*30*$E119,\"\")","v":""},{"$f":"IFERROR(R119*30*$E119,\"\")","v":""},null,{"$f":"IFERROR(VLOOKUP(B119,$B$16:$V$22,21,FALSE),\"\")","v":""}]
[{"$f":"IF(B120>0,0,0)","v":0},null,null,null,{"$f":"IFERROR(IF(B120=\"All units\",$D$23,(V120+1)*D120),0)","v":0},null,{"$f":"IFERROR(VLOOKUP(F120,$B$111:$C$114,2,FALSE),\"\")","v":""},null,"",null,{"$f":"IFERROR(VLOOKUP(J120,$B$111:$C$114,2,FALSE),\"\")","v":""},null,{"$f":"IFERROR(VLOOKUP(L120,$B$111:$C$114,2,FALSE),\"\")","v":""},{"$f":"IFERROR(SUM(G120,I120,K120,M120)/COUNTA(F120,H120,J120,L120),\"\")","v":""},{"$f":"IFERROR(N120*$P120,\"\")","v":""},{"$f":"IF(B120<>\"\",$C$150,\"\")","v":""},{"$f":"IF(B120<>\"\",IF(Instructions!$I$85=1,$F$150,$H$150),\"\")","v":""},{"$f":"IF(B120<>\"\",IF(Instructions!$I$85=1,$J$150,$K$150),\"\")","v":""},{"$f":"IFERROR(O120*30*$E120,\"\")","v":""},{"$f":"IFERROR(R120*30*$E120,\"\")","v":""},null,{"$f":"IFERROR(VLOOKUP(B120,$B$16:$V$22,21,FALSE),\"\")","v":""}]
[{"$f":"IF(B121>0,0,0)","v":0},null,null,null,{"$f":"IFERROR(IF(B121=\"All units\",$D$23,(V121+1)*D121),0)","v":0},null,"",null,"",null,{"$f":"IFERROR(VLOOKUP(J121,$B$111:$C$114,2,FALSE),\"\")","v":""},null,{"$f":"IFERROR(VLOOKUP(L121,$B$111:$C$114,2,FALSE),\"\")","v":""},"",{"$f":"IFERROR(N121*$P121,\"\")","v":""},{"$f":"IF(B121<>\"\",$C$150,\"\")","v":""},{"$f":"IF(B121<>\"\",IF(Instructions!$I$85=1,$F$150,$H$150),\"\")","v":""},{"$f":"IF(B121<>\"\",IF(Instructions!$I$85=1,$J$150,$K$150),\"\")","v":""},"","",null,{"$f":"IFERROR(VLOOKUP(B121,$B$16:$V$22,21,FALSE),\"\")","v":""}]
[null,null,null,null,{"$f":"IFERROR(IF(B122=\"All units\",$D$23,(V122+1)*D122),0)","v":0},null,"",null,"",null,{"$f":"IFERROR(VLOOKUP(J122,$B$111:$C$114,2,FALSE),\"\")","v":""},null,{"$f":"IFERROR(VLOOKUP(L122,$B$111:$C$114,2,FALSE),\"\")","v":""},"",{"$f":"IFERROR(N122*$P122,\"\")","v":""},{"$f":"IF(B122<>\"\",$C$150,\"\")","v":""},{"$f":"IF(B122<>\"\",IF(Instructions!$I$85=1,$F$150,$H$150),\"\")","v":""},{"$f":"IF(B122<>\"\",IF(Instructions!$I$85=1,$J$150,$K$150),\"\")","v":""},"","",null,{"$f":"IFERROR(VLOOKUP(B122,$B$16:$V$22,21,FALSE),\"\")","v":""}]
[null,null,null,null,{"$f":"IFERROR(IF(B123=\"All units\",$D$23,(V123+1)*D123),0)","v":0},null,"",null,"",null,{"$f":"IFERROR(VLOOKUP(J123,$B$111:$C$114,2,FALSE),\"\")","v":""},null,{"$f":"IFERROR(VLOOKUP(L123,$B$111:$C$114,2,FALSE),\"\")","v":""},"",{"$f":"IFERROR(N123*$P123,\"\")","v":""},{"$f":"IF(B123<>\"\",$C$150,\"\")","v":""},{"$f":"IF(B123<>\"\",IF(Instructions!$I$85=1,$F$150,$H$150),\"\")","v":""},{"$f":"IF(B123<>\"\",IF(Instructions!$I$85=1,$J$150,$K$150),\"\")","v":""},"","",null,{"$f":"IFERROR(VLOOKUP(B123,$B$16:$V$22,21,FALSE),\"\")","v":""}]
["F","Totals for dishwashers",null,{"$f":"SUM(D119:D123)","v":0},{"$f":"SUM(E119:E123)","v":0},null,null,null,null,null,null,null,null,null,null,null,null,null,{"$f":"SUM(S119:S123)","v":0},{"$f":"SUM(T119:T123)","v":0}]
[]
[]
[null,"Indoor Water Use Summary"]
[null,"Fixture Type",null,null,null,null,{"$f":"CONCATENATE(\"Design\nWater Use\n\",IF(Instructions!$I$85=1,\" (gal/month)\",\" (l/month)\"))","v":"Design\nWater Use\n (gal/month)"},{"$f":"CONCATENATE(\"Baseline\nWater Use\n\",IF(Instructions!$I$85=1,\" (gal/month)\",\" (l/month)\"))","v":"Baseline\nWater Use\n (gal/month)"},{"$f":"CONCATENATE(\"Savings\n\",IF(Instructions!$I$85=1,\" (gal/month)\",\" (l/month)\"))","v":"Savings\n (gal/month)"}]
[null,"Showers",null,null,null,null,{"$f":"S44","v":0},{"$f":"T44","v":0},{"$f":"IF(G129=0,0,H129-G129)","v":0}]
[null,"Lavatories and kitchen faucets",null,null,null,null,{"$f":"S62","v":0},{"$f":"T62","v":0},{"$f":"IF(G130=0,0,H130-G130)","v":0}]
[null,"Toilets",null,null,null,null,{"$f":"S86","v":0},{"$f":"T86","v":0},{"$f":"IF(G131=0,0,H131-G131)","v":0}]
[null,"Clothes washers",null,null,null,null,{"$f":"S105","v":0},{"$f":"T105","v":0},{"$f":"IF(G132=0,0,H132-G132)","v":0}]
[null,"Dishwashers",null,null,null,null,{"$f":"S124","v":0},{"$f":"T124","v":0},{"$f":"IF(G133=0,0,H133-G133)","v":0}]
[null,"Totals",null,null,null,null,{"$f":"SUM(G129:G133)","v":0},{"$f":"SUM(H129:H133)","v":0},{"$f":"SUM(I129:I133)","v":0}]
[]
[null,"Results"]
[null,null,null,null,null,null,{"$f":"CONCATENATE(\"Design\nWater Use\n\",IF(Instructions!$I$85=1,\" (gal/month)\",\" (l/month)\"))","v":"Design\nWater Use\n (gal/month)"},{"$f":"CONCATENATE(\"Baseline\nWater Use\n\",IF(Instructions!$I$85=1,\" (gal/month)\",\" (l/month)\"))","v":"Baseline\nWater Use\n (gal/month)"},{"$f":"CONCATENATE(\"Savings\n\",IF(Instructions!$I$85=1,\" (gal/month)\",\" (l/month)\"))","v":"Savings\n (gal/month)"}]
[null,"Outdoor water use",null,null,null,null,{"$f":"MAX(0,I10-I11)","v":0},{"$f":"MAX(0,I9)","v":0},{"$f":"MAX(0,H138-G138)","v":0}]
[null,"Indoor water use",null,null,null,null,{"$f":"MAX(0,G134)","v":0},{"$f":"MAX(0,H134)","v":0},{"$f":"MAX(0,I134)","v":0}]
[null,"Totals",null,null,null,null,{"$f":"SUM(G138:G139)","v":0},{"$f":"SUM(H138:H139)","v":0},{"$f":"SUM(I138:I139)","v":0}]
[null,"Total monthly water savings as a percentage of total water use (%)",null,null,null,null,null,null,{"$f":"IFERROR((H140-G140)/H140,0)","v":0}]
[]
[null,"Assumptions"]
[null,"Fixture","Estimated \nFixture Usage",null,null,"Baseline \nFlush or Flow Rate",null,null,null,"Estimated \nWater Usage"]
[null,null,null,null,null,"IP",null,"SI",null,"IP\n(gallons per person)","SI\n(liters per person)"]
[null,"Shower",{"$f":"8.2*0.75","v":6.1499999999999995},"minutes",null,2.5,"gpm",9.5,"lpm",{"$f":"F146*C146","v":15.374999999999998},{"$f":"H146*C146","v":58.424999999999997}]
[null,"Lavatory or kitchen faucet",5,"minutes",null,2.2000000000000002,"gpm",8.3000000000000007,"lpm",{"$f":"F147*C147","v":11},{"$f":"H147*C147","v":41.5}]
[null,"Toilet",5.05,"flushes",null,1.6,"gpf",6,"lpf",{"$f":"F148*C148","v":8.08},{"$f":"H148*C148","v":30.299999999999997}]
[null,"Clothes washer",0.37,"at 3.5 cu ft (0.1 cu m)",null,9.5,"WF",9.5,"WF",{"$f":"(C149*F149*3.5)*1.23","v":15.132075},{"$f":"((C149*F149*3.5)*1.23)*3.78","v":57.199243500000001}]
[null,"Dishwasher",0.1,"cycles",null,6.5,"gpc",24,"lpc",{"$f":"F150*C150","v":0.65},{"$f":"H150*C150","v":2.4000000000000004}]

{"sheet":"Sampling Reporting Form","index":18,"n_rows":22,"n_cols":13,"rows_kept":22,"cut":false,"hidden":false,"merged":[[4,6,5,6],[4,7,4,9],[4,12,5,12],[4,10,4,11],[4,1,5,1],[4,2,5,2],[4,3,5,3],[4,4,5,4],[4,5,5,5]]}
[]
[null,"Sampling Reporting Form"]
[]
[]
[null,"Sample Set","Size of\nSample Set\n(Number of Lots/Units)","Lot/Unit Numbers \nwithin \nSample Set","Sampling \nRate\n(%)","Number of \nUnits or Buildings Verified","Lot/Unit Numbers\nVerified","On-site Verification",null,null,"Failures",null,"Notes"]
[null,null,null,null,null,null,null,"Pre-Slab\nVerification Date","Pre-Drywall\nVerification Date","Final\nVerification Date","Lot/Unit Number \nof any Failures","Remediation Activity\nfor Failure"]
[{"$f":"IF(B7=1,0,0)","v":0},1]
[{"$f":"IF(B8=1,0,0)","v":0},2]
[0,3]
[0,4]
[0,5]
[{"$f":"IF(B12=1,0,0)","v":0},1]
[0,2]
[0,3]
[0,4]
[0,5]
[{"$f":"IF(B17=1,0,0)","v":0}]
[]
[]
["A","Total number of units selected for verification",null,null,null,{"$f":"SUM(F7:F19)","v":0}]
[null,"Total number of units or buildings utilizing sampling",null,null,null,{"$f":"SUM(C7:C19)","v":0}]
[null,"Overall sampling rate (%)",null,null,null,{"$f":"IFERROR(F20/F21,0)","v":0}]

{"sheet":"MRc Construction Waste Mgmt","index":19,"n_rows":17,"n_cols":3,"rows_kept":17,"cut":false,"hidden":true,"merged":[]}
["Bedrooms","Conditioned Floor Area (SF)","Waste (LBS)"]
[0,1000,4200]
[1,1000,4200]
[2,1600,6720]
[3,2200,9240]
[4,2800,11760]
[5,3400,14280]
[6,4000,16800]
[7,4600,19320]
[8,5200,21840]
[9,5800,24360]
[10,6400,26880]
[11,7000,29400]
[12,7600,31920]
[13,8200,34440]
[14,8800,36960]
[15,9400,39480]

{"sheet":"Scorecard Data","index":20,"n_rows":619,"n_cols":17,"rows_kept":619,"cut":false,"hidden":true,"merged":[]}
["Project ID #",{"$f":"Instructions!F56","v":0}]
["Units",{"$f":"Instructions!F12","v":0}]
["Rating System",{"$f":"Instructions!F15","v":"LEED BD+C: Homes  v4.1 - LEED v4"}]
["Building type",{"$f":"IF(Type=\"Batch\",Instructions!F73,Instructions!F63)","v":0}]
["Project name",{"$f":"Instructions!F57","v":0}]
["Project address",{"$f":"Instructions!F58","v":0}]
["City",{"$f":"Instructions!F59","v":0}]
["State",{"$f":"Instructions!F60","v":0}]
["Country",{"$f":"Instructions!F61","v":0}]
["Zip code",{"$f":"Instructions!F62","v":0}]
["Number of stories",{"$f":"Instructions!F64","v":0}]
["Conditioned floor area",{"$f":"Instructions!F66","v":0}]
["Gross floor area",{"$f":"Instructions!F68","v":""}]
["Number of bedrooms",{"$f":"Instructions!F65","v":0}]
["Number of units",{"$f":"'Multifamily HSA'!P12","v":0}]
["Gut-rehab",{"$f":"IF(Instructions!F25=\"Gut-rehab\",\"Yes\",\"No\")","v":"No"}]
["Sampling applied",{"$f":"IF('Sampling Reporting Form'!F22>0,\"Yes\",\"No\")","v":"No"}]
["Rating system","Credit category","P/C","Credit name","Credit ID","Credit Attempted","Pts \nVerified","Total Pts Possible ","Threshold Name","Short ID","Attempted","Option name","Short ID","Attempted","Path name","Short ID","Attempted"]
["LEED v4 BD+C: Homes","IP","C","Integrative process","IP102",{"$f":"IF(IP!$J$7>0,\"X\",\"\")","v":""},{"$f":"IP!$J$7","v":0},2,null,null,null,"Option 1","IP02O1",{"$f":"IF(IP!$J$11>0,\"X\",\"\")","v":""}]
["LEED v4 BD+C: Homes","IP","C","Integrative process","IP102",{"$f":"IF(IP!$J$7>0,\"X\",\"\")","v":""},{"$f":"IP!$J$7","v":0},2,null,null,null,"Option 2","IP02O2",{"$f":"IF(IP!$J$33>0,\"X\",\"\")","v":""}]
["LEED v4 BD+C: Homes","IP","C","Integrative process","IP102",{"$f":"IF(IP!$J$7>0,\"X\",\"\")","v":""},{"$f":"IP!$J$7","v":0},2,null,null,null,"Option 3","IP02O3",{"$f":"IF(IP!$J$42>0,\"X\",\"\")","v":""}]
["LEED v4 BD+C: Homes","LT","P","Floodplain avoidance","LT101","x",{"$f":"LT!$J$7","v":"N"},0]
["LEED v4 BD+C: Homes","LT","C","LEED for Neighborhood Development","LT102",{"$f":"IF(LT!$J$19>0,\"X\",\"\")","v":""},{"$f":"LT!$J$19","v":0},15]
["LEED v4 BD+C: Homes","LT","C","Site selection","LT103",{"$f":"IF(LT!$J$32>0,\"X\",\"\")","v":""},{"$f":"LT!$J$32","v":0},8,null,null,null,"Option 1","LT03O1",{"$f":"IF(LT!$J$36>0,\"X\",\"\")","v":""}]
["LEED v4 BD+C: Homes","LT","C","Site selection","LT103",{"$f":"IF(LT!$J$32>0,\"X\",\"\")","v":""},{"$f":"LT!$J$32","v":0},8,null,null,null,"Option 1","LT03O1",{"$f":"IF(LT!$J$36>0,\"X\",\"\")","v":""},"Path 1","LT03O1P1",{"$f":"IF(LT!$J$39>0,\"X\",\"\")","v":""}]
["LEED v4 BD+C: Homes","LT","C","Site selection","LT103",{"$f":"IF(LT!$J$32>0,\"X\",\"\")","v":""},{"$f":"LT!$J$32","v":0},8,null,null,null,"Option 1","LT03O1",{"$f":"IF(LT!$J$36>0,\"X\",\"\")","v":""},"Path 2","LT03O1P2",{"$f":"IF(LT!$J$47>0,\"X\",\"\")","v":""}]
["LEED v4 BD+C: Homes","LT","C","Site selection","LT103",{"$f":"IF(LT!$J$32>0,\"X\",\"\")","v":""},{"$f":"LT!$J$32","v":0},8,null,null,null,"Option 2","LT03O2",{"$f":"IF(LT!$J$62>0,\"X\",\"\")","v":""}]
["LEED v4 BD+C: Homes","LT","C","Site selection","LT103",{"$f":"IF(LT!$J$32>0,\"X\",\"\")","v":""},{"$f":"LT!$J$32","v":0},8,null,null,null,"Option 3","LT03O3",{"$f":"IF(LT!$J$71>0,\"X\",\"\")","v":""}]
["LEED v4 BD+C: Homes","LT","C","Site selection","LT103",{"$f":"IF(LT!$J$32>0,\"X\",\"\")","v":""},{"$f":"LT!$J$32","v":0},8,null,null,null,"Option 4","LT03O4",{"$f":"IF(LT!$J$79>0,\"X\",\"\")","v":""}]
["LEED v4 BD+C: Homes","LT","C","Site selection","LT103",{"$f":"IF(LT!$J$32>0,\"X\",\"\")","v":""},{"$f":"LT!$J$32","v":0},8,null,null,null,"Option 5","LT03O5",{"$f":"IF(LT!$J$85>0,\"X\",\"\")","v":""}]
["LEED v4 BD+C: Homes","LT","C","Compact development","LT104",{"$f":"IF(LT!$J$111>0,\"X\",\"\")","v":""},{"$f":"LT!$J$111","v":0},3,"1 point","LT04T1",{"$f":"IF($G$31=1,\"X\",\"\")","v":""}]
["LEED v4 BD+C: Homes","LT","C","Compact development","LT104",{"$f":"IF(LT!$J$111>0,\"X\",\"\")","v":""},{"$f":"LT!$J$111","v":0},3,"2 points","LT04T2",{"$f":"IF($G$32=2,\"X\",\"\")","v":""}]
["LEED v4 BD+C: Homes","LT","C","Compact development","LT104",{"$f":"IF(LT!$J$111>0,\"X\",\"\")","v":""},{"$f":"LT!$J$111","v":0},3,"3 points","LT04T3",{"$f":"IF($G$33=3,\"X\",\"\")","v":""}]
["LEED v4 BD+C: Homes","LT","C","Community resources","LT105",{"$f":"IF(LT!$J$122>0,\"X\",\"\")","v":""},{"$f":"LT!$J$122","v":0},2,"1 point","LT05T1",{"$f":"IF($G$34=1,\"X\",\"\")","v":""}]
["LEED v4 BD+C: Homes","LT","C","Community resources","LT105",{"$f":"IF(LT!$J$122>0,\"X\",\"\")","v":""},{"$f":"LT!$J$122","v":0},2,"1.5 points","LT05T2",{"$f":"IF($G$35=1.5,\"X\",\"\")","v":""}]
["LEED v4 BD+C: Homes","LT","C","Community resources","LT105",{"$f":"IF(LT!$J$122>0,\"X\",\"\")","v":""},{"$f":"LT!$J$122","v":0},2,"2 points","LT05T3",{"$f":"IF($G$36=2,\"X\",\"\")","v":""}]
["LEED v4 BD+C: Homes","LT","C","Access to transit","LT106",{"$f":"IF(LT!$J$130>0,\"X\",\"\")","v":""},{"$f":"LT!$J$130","v":0},2,"1 point","LT06T1",{"$f":"IF($G$37=1,\"X\",\"\")","v":""}]
["LEED v4 BD+C: Homes","LT","C","Access to transit","LT106",{"$f":"IF(LT!$J$130>0,\"X\",\"\")","v":""},{"$f":"LT!$J$130","v":0},2,"1.5 points","LT06T2",{"$f":"IF($G$38=1.5,\"X\",\"\")","v":""}]
["LEED v4 BD+C: Homes","LT","C","Access to transit","LT106",{"$f":"IF(LT!$J$130>0,\"X\",\"\")","v":""},{"$f":"LT!$J$130","v":0},2,"2 points","LT06T3",{"$f":"IF($G$39=2,\"X\",\"\")","v":""}]
["LEED v4 BD+C: Homes","SS","P","Construction activity pollution prevention","SS101","x",{"$f":"SS!$J$7","v":"N"},0]
["LEED v4 BD+C: Homes","SS","P","No invasive plants","SS102","x",{"$f":"SS!#REF!","v":{"$error":"#REF!"}},0]
["LEED v4 BD+C: Homes","SS","C","Heat island reduction","SS110",{"$f":"IF(SS!$J$34>0,\"X\",\"\")","v":""},{"$f":"SS!$J$34","v":0},2,null,null,null,"Option 1","SS10O1",{"$f":"IF(SS!$J$38>0,\"X\",\"\")","v":""}]
["LEED v4 BD+C: Homes","SS","C","Heat island reduction","SS110",{"$f":"IF(SS!$J$34>0,\"X\",\"\")","v":""},{"$f":"SS!$J$34","v":0},2,null,null,null,"Option 1","SS10O1",{"$f":"IF(SS!$J$38>0,\"X\",\"\")","v":""},"1 point","SS10O1P1",{"$f":"IF(SS!$J$38=1,\"X\",\"\")","v":""}]
["LEED v4 BD+C: Homes","SS","C","Heat island reduction","SS110",{"$f":"IF(SS!$J$34>0,\"X\",\"\")","v":""},{"$f":"SS!$J$34","v":0},2,null,null,null,"Option 1","SS10O1",{"$f":"IF(SS!$J$38>0,\"X\",\"\")","v":""},"2 points","SS10O1P2",{"$f":"IF(SS!$J$38=2,\"X\",\"\")","v":""}]
["LEED v4 BD+C: Homes","SS","C","Heat island reduction","SS110",{"$f":"IF(SS!$J$34>0,\"X\",\"\")","v":""},{"$f":"SS!$J$34","v":0},2,null,null,null,"Option 2","SS10O2",{"$f":"IF(SS!#REF!>0,\"X\",\"\")","v":{"$error":"#REF!"}}]
["LEED v4 BD+C: Homes","SS","C","Heat island reduction","SS110",{"$f":"IF(SS!$J$34>0,\"X\",\"\")","v":""},{"$f":"SS!$J$34","v":0},2,null,null,null,"Option 2","SS10O2",{"$f":"IF(SS!#REF!>0,\"X\",\"\")","v":{"$error":"#REF!"}},"1 point","SS10O2P1",{"$f":"IF(SS!#REF!=1,\"X\",\"\")","v":{"$error":"#REF!"}}]
["LEED v4 BD+C: Homes","SS","C","Heat island reduction","SS110",{"$f":"IF(SS!$J$34>0,\"X\",\"\")","v":""},{"$f":"SS!$J$34","v":0},2,null,null,null,"Option 2","SS10O2",{"$f":"IF(SS!#REF!>0,\"X\",\"\")","v":{"$error":"#REF!"}},"2 points","SS10O2P2",{"$f":"IF(SS!#REF!=2,\"X\",\"\")","v":{"$error":"#REF!"}}]
["LEED v4 BD+C: Homes","SS","C","Rainwater management","SS108",{"$f":"IF(SS!$J$66>0,\"X\",\"\")","v":""},{"$f":"SS!$J$66","v":0},3,null,null,null,"Case 1","SS08O1",{"$f":"IF(SS!$J$71>0,\"X\",\"\")","v":""}]
["LEED v4 BD+C: Homes","SS","C","Rainwater management","SS108",{"$f":"IF(SS!$J$66>0,\"X\",\"\")","v":""},{"$f":"SS!$J$66","v":0},3,null,null,null,"Case 1","SS08O1",{"$f":"IF(SS!$J$71>0,\"X\",\"\")","v":""},"1 point","SS08O1P1",{"$f":"IF(SS!$J$71=1,\"X\",\"\")","v":""}]
["LEED v4 BD+C: Homes","SS","C","Rainwater management","SS108",{"$f":"IF(SS!$J$66>0,\"X\",\"\")","v":""},{"$f":"SS!$J$66","v":0},3,null,null,null,"Case 1","SS08O1",{"$f":"IF(SS!$J$71>0,\"X\",\"\")","v":""},"2 points","SS08O1P2",{"$f":"IF(SS!$J$71=2,\"X\",\"\")","v":""}]
["LEED v4 BD+C: Homes","SS","C","Rainwater management","SS108",{"$f":"IF(SS!$J$66>0,\"X\",\"\")","v":""},{"$f":"SS!$J$66","v":0},3,null,null,null,"Case 1","SS08O1",{"$f":"IF(SS!$J$71>0,\"X\",\"\")","v":""},"3 points","SS08O1P3",{"$f":"IF(SS!$J$71=3,\"X\",\"\")","v":""}]
["LEED v4 BD+C: Homes","SS","C","Rainwater management","SS108",{"$f":"IF(SS!$J$66>0,\"X\",\"\")","v":""},{"$f":"SS!$J$66","v":0},3,null,null,null,"Case 2","SS08O2",{"$f":"IF(SS!$J$100>0,\"X\",\"\")","v":""}]
["LEED v4 BD+C: Homes","SS","C","Rainwater management","SS108",{"$f":"IF(SS!$J$66>0,\"X\",\"\")","v":""},{"$f":"SS!$J$66","v":0},3,null,null,null,"Case 2","SS08O2",{"$f":"IF(SS!$J$100>0,\"X\",\"\")","v":""},"2 points","SS08O2P1",{"$f":"IF(SS!$J$100=2,\"X\",\"\")","v":""}]
["LEED v4 BD+C: Homes","SS","C","Rainwater management","SS108",{"$f":"IF(SS!$J$66>0,\"X\",\"\")","v":""},{"$f":"SS!$J$66","v":0},3,null,null,null,"Case 2","SS08O2",{"$f":"IF(SS!$J$100>0,\"X\",\"\")","v":""},"3 points","SS08O2P2",{"$f":"IF(SS!$J$100=3,\"X\",\"\")","v":""}]
["LEED v4 BD+C: Homes","SS","C","Nontoxic pest control","SS112",{"$f":"IF(SS!$J$122>0,\"X\",\"\")","v":""},{"$f":"SS!$J$122","v":0},2,"0.5 points","SS12T1",{"$f":"IF($G$55=0.5,\"X\",\"\")","v":""}]
["LEED v4 BD+C: Homes","SS","C","Nontoxic pest control","SS112",{"$f":"IF(SS!$J$122>0,\"X\",\"\")","v":""},{"$f":"SS!$J$122","v":0},2,"1 point","SS12T2",{"$f":"IF($G$56=1,\"X\",\"\")","v":""}]
["LEED v4 BD+C: Homes","SS","C","Nontoxic pest control","SS112",{"$f":"IF(SS!$J$122>0,\"X\",\"\")","v":""},{"$f":"SS!$J$122","v":0},2,"1.5 points","SS12T3",{"$f":"IF($G$57=1.5,\"X\",\"\")","v":""}]
["LEED v4 BD+C: Homes","SS","C","Nontoxic pest control","SS112",{"$f":"IF(SS!$J$122>0,\"X\",\"\")","v":""},{"$f":"SS!$J$122","v":0},2,"2 points","SS12T4",{"$f":"IF($G$58=2,\"X\",\"\")","v":""}]
["LEED v4 BD+C: Homes","WE","P","Water metering","WE101","x",{"$f":"WE!$J$23","v":0},0,null,null,null,"Case 1","WE01O1",{"$f":"IF(WE!#REF!=\"Y\",\"X\",\"\")","v":{"$error":"#REF!"}}]
["LEED v4 BD+C: Homes","WE","P","Water metering","WE101","x",{"$f":"WE!$J$23","v":0},0,null,null,null,"Case 2","WE01O2",{"$f":"IF(WE!#REF!=\"Y\",\"X\",\"\")","v":{"$error":"#REF!"}}]
["LEED v4 BD+C: Homes","WE","C","Total water use","WE102",{"$f":"IF(WE!$J$32>0,\"X\",\"\")","v":""},{"$f":"WE!$J$32","v":0},12,"1 point","WE02T1",{"$f":"IF($G$61=1,\"X\",\"\")","v":""}]
["LEED v4 BD+C: Homes","WE","C","Total water use","WE102",{"$f":"IF(WE!$J$32>0,\"X\",\"\")","v":""},{"$f":"WE!$J$32","v":0},12,"2 points","WE02T2",{"$f":"IF($G$62=2,\"X\",\"\")","v":""}]
["LEED v4 BD+C: Homes","WE","C","Total water use","WE102",{"$f":"IF(WE!$J$32>0,\"X\",\"\")","v":""},{"$f":"WE!$J$32","v":0},12,"3 points","WE02T3",{"$f":"IF($G$63=3,\"X\",\"\")","v":""}]
["LEED v4 BD+C: Homes","WE","C","Total water use","WE102",{"$f":"IF(WE!$J$32>0,\"X\",\"\")","v":""},{"$f":"WE!$J$32","v":0},12,"4 points","WE02T4",{"$f":"IF($G$64=4,\"X\",\"\")","v":""}]
["LEED v4 BD+C: Homes","WE","C","Total water use","WE102",{"$f":"IF(WE!$J$32>0,\"X\",\"\")","v":""},{"$f":"WE!$J$32","v":0},12,"5 points","WE02T5",{"$f":"IF($G$65=5,\"X\",\"\")","v":""}]
["LEED v4 BD+C: Homes","WE","C","Total water use","WE102",{"$f":"IF(WE!$J$32>0,\"X\",\"\")","v":""},{"$f":"WE!$J$32","v":0},12,"6 points","WE02T6",{"$f":"IF($G$66=6,\"X\",\"\")","v":""}]
["LEED v4 BD+C: Homes","WE","C","Total water use","WE102",{"$f":"IF(WE!$J$32>0,\"X\",\"\")","v":""},{"$f":"WE!$J$32","v":0},12,"7 points","WE02T7",{"$f":"IF($G$67=7,\"X\",\"\")","v":""}]
["LEED v4 BD+C: Homes","WE","C","Total water use","WE102",{"$f":"IF(WE!$J$32>0,\"X\",\"\")","v":""},{"$f":"WE!$J$32","v":0},12,"8 points","WE02T8",{"$f":"IF($G$68=8,\"X\",\"\")","v":""}]
["LEED v4 BD+C: Homes","WE","C","Total water use","WE102",{"$f":"IF(WE!$J$32>0,\"X\",\"\")","v":""},{"$f":"WE!$J$32","v":0},12,"9 points","WE02T9",{"$f":"IF($G$69=9,\"X\",\"\")","v":""}]
["LEED v4 BD+C: Homes","WE","C","Total water use","WE102",{"$f":"IF(WE!$J$32>0,\"X\",\"\")","v":""},{"$f":"WE!$J$32","v":0},12,"10 points","WE02T10",{"$f":"IF($G$70=10,\"X\",\"\")","v":""}]
["LEED v4 BD+C: Homes","WE","C","Total water use","WE102",{"$f":"IF(WE!$J$32>0,\"X\",\"\")","v":""},{"$f":"WE!$J$32","v":0},12,"11 points","WE02T11",{"$f":"IF($G$71=11,\"X\",\"\")","v":""}]
["LEED v4 BD+C: Homes","WE","C","Total water use","WE102",{"$f":"IF(WE!$J$32>0,\"X\",\"\")","v":""},{"$f":"WE!$J$32","v":0},12,"12 points","WE02T12",{"$f":"IF($G$72=12,\"X\",\"\")","v":""}]
["LEED v4 BD+C: Homes","WE","C","Indoor water use","WE103",{"$f":"IF(WE!$J$43>0,\"X\",\"\")","v":""},{"$f":"WE!$J$43","v":0},6,null,null,null,"Case 1","WE03O1",{"$f":"IF(WE!#REF!>0,\"X\",\"\")","v":{"$error":"#REF!"}}]
["LEED v4 BD+C: Homes","WE","C","Indoor water use","WE103",{"$f":"IF(WE!$J$43>0,\"X\",\"\")","v":""},{"$f":"WE!$J$43","v":0},6,null,null,null,"Case 1","WE03O1",{"$f":"IF(WE!#REF!>0,\"X\",\"\")","v":{"$error":"#REF!"}},"1 point","WE03O1P1",{"$f":"IF(WE!#REF!=1,\"X\",\"\")","v":{"$error":"#REF!"}}]
["LEED v4 BD+C: Homes","WE","C","Indoor water use","WE103",{"$f":"IF(WE!$J$43>0,\"X\",\"\")","v":""},{"$f":"WE!$J$43","v":0},6,null,null,null,"Case 1","WE03O1",{"$f":"IF(WE!#REF!>0,\"X\",\"\")","v":{"$error":"#REF!"}},"2 points","WE03O1P2",{"$f":"IF(WE!#REF!=2,\"X\",\"\")","v":{"$error":"#REF!"}}]
["LEED v4 BD+C: Homes","WE","C","Indoor water use","WE103",{"$f":"IF(WE!$J$43>0,\"X\",\"\")","v":""},{"$f":"WE!$J$43","v":0},6,null,null,null,"Case 1","WE03O1",{"$f":"IF(WE!#REF!>0,\"X\",\"\")","v":{"$error":"#REF!"}},"3 points","WE03O1P3",{"$f":"IF(WE!#REF!=3,\"X\",\"\")","v":{"$error":"#REF!"}}]
["LEED v4 BD+C: Homes","WE","C","Indoor water use","WE103",{"$f":"IF(WE!$J$43>0,\"X\",\"\")","v":""},{"$f":"WE!$J$43","v":0},6,null,null,null,"Case 1","WE03O1",{"$f":"IF(WE!#REF!>0,\"X\",\"\")","v":{"$error":"#REF!"}},"4 points","WE03O1P4",{"$f":"IF(WE!#REF!=4,\"X\",\"\")","v":{"$error":"#REF!"}}]
["LEED v4 BD+C: Homes","WE","C","Indoor water use","WE103",{"$f":"IF(WE!$J$43>0,\"X\",\"\")","v":""},{"$f":"WE!$J$43","v":0},6,null,null,null,"Case 1","WE03O1",{"$f":"IF(WE!#REF!>0,\"X\",\"\")","v":{"$error":"#REF!"}},"5 points","WE03O1P5",{"$f":"IF(WE!#REF!=5,\"X\",\"\")","v":{"$error":"#REF!"}}]
["LEED v4 BD+C: Homes","WE","C","Indoor water use","WE103",{"$f":"IF(WE!$J$43>0,\"X\",\"\")","v":""},{"$f":"WE!$J$43","v":0},6,null,null,null,"Case 1","WE03O1",{"$f":"IF(WE!#REF!>0,\"X\",\"\")","v":{"$error":"#REF!"}},"6 points","WE03O1P6",{"$f":"IF(WE!#REF!=6,\"X\",\"\")","v":{"$error":"#REF!"}}]
["LEED v4 BD+C: Homes","WE","C","Indoor water use","WE103",{"$f":"IF(WE!$J$43>0,\"X\",\"\")","v":""},{"$f":"WE!$J$43","v":0},6,null,null,null,"Case 2","WE03O2",{"$f":"IF(WE!#REF!>0,\"X\",\"\")","v":{"$error":"#REF!"}}]
["LEED v4 BD+C: Homes","WE","C","Indoor water use","WE103",{"$f":"IF(WE!$J$43>0,\"X\",\"\")","v":""},{"$f":"WE!$J$43","v":0},6,null,null,null,"Case 2","WE03O2",{"$f":"IF(WE!#REF!>0,\"X\",\"\")","v":{"$error":"#REF!"}},"1 point","WE03O2P1",{"$f":"IF(WE!#REF!=1,\"X\",\"\")","v":{"$error":"#REF!"}}]
["LEED v4 BD+C: Homes","WE","C","Indoor water use","WE103",{"$f":"IF(WE!$J$43>0,\"X\",\"\")","v":""},{"$f":"WE!$J$43","v":0},6,null,null,null,"Case 2","WE03O2",{"$f":"IF(WE!#REF!>0,\"X\",\"\")","v":{"$error":"#REF!"}},"2 points","WE03O2P2",{"$f":"IF(WE!#REF!=2,\"X\",\"\")","v":{"$error":"#REF!"}}]
["LEED v4 BD+C: Homes","WE","C","Indoor water use","WE103",{"$f":"IF(WE!$J$43>0,\"X\",\"\")","v":""},{"$f":"WE!$J$43","v":0},6,null,null,null,"Case 2","WE03O2",{"$f":"IF(WE!#REF!>0,\"X\",\"\")","v":{"$error":"#REF!"}},"3 points","WE03O2P3",{"$f":"IF(WE!#REF!=3,\"X\",\"\")","v":{"$error":"#REF!"}}]
["LEED v4 BD+C: Homes","WE","C","Indoor water use","WE103",{"$f":"IF(WE!$J$43>0,\"X\",\"\")","v":""},{"$f":"WE!$J$43","v":0},6,null,null,null,"Case 2","WE03O2",{"$f":"IF(WE!#REF!>0,\"X\",\"\")","v":{"$error":"#REF!"}},"4 points","WE03O2P4",{"$f":"IF(WE!#REF!=4,\"X\",\"\")","v":{"$error":"#REF!"}}]
["LEED v4 BD+C: Homes","WE","C","Indoor water use","WE103",{"$f":"IF(WE!$J$43>0,\"X\",\"\")","v":""},{"$f":"WE!$J$43","v":0},6,null,null,null,"Case 2","WE03O2",{"$f":"IF(WE!#REF!>0,\"X\",\"\")","v":{"$error":"#REF!"}},"5 points","WE03O2P5",{"$f":"IF(WE!#REF!=5,\"X\",\"\")","v":{"$error":"#REF!"}}]
["LEED v4 BD+C: Homes","WE","C","Indoor water use","WE103",{"$f":"IF(WE!$J$43>0,\"X\",\"\")","v":""},{"$f":"WE!$J$43","v":0},6,null,null,null,"Case 2","WE03O2",{"$f":"IF(WE!#REF!>0,\"X\",\"\")","v":{"$error":"#REF!"}},"6 points","WE03O2P6",{"$f":"IF(WE!#REF!=6,\"X\",\"\")","v":{"$error":"#REF!"}}]
["LEED v4 BD+C: Homes","WE","C","Outdoor water use","WE104",{"$f":"IF(WE!$J$65>0,\"X\",\"\")","v":""},{"$f":"WE!$J$65","v":0},4,"1 point","WE04T1",{"$f":"IF(G87=1,\"X\",\"\")","v":""}]
["LEED v4 BD+C: Homes","WE","C","Outdoor water use","WE104",{"$f":"IF(WE!$J$65>0,\"X\",\"\")","v":""},{"$f":"WE!$J$65","v":0},4,"2 points","WE04T2",{"$f":"IF(G88=2,\"X\",\"\")","v":""}]
["LEED v4 BD+C: Homes","WE","C","Outdoor water use","WE104",{"$f":"IF(WE!$J$65>0,\"X\",\"\")","v":""},{"$f":"WE!$J$65","v":0},4,"3 points","WE04T3",{"$f":"IF(G89=3,\"X\",\"\")","v":""}]
["LEED v4 BD+C: Homes","WE","C","Outdoor water use","WE104",{"$f":"IF(WE!$J$65>0,\"X\",\"\")","v":""},{"$f":"WE!$J$65","v":0},4,"4 points","WE04T4",{"$f":"IF(G90=4,\"X\",\"\")","v":""}]
["LEED v4 BD+C: Homes","EA","P","Minimum energy performance","EA101","x",{"$f":"EA!$J$7","v":"N"},0]
["LEED v4 BD+C: Homes","EA","P","Energy metering","EA102","x",{"$f":"EA!$J$30","v":0},0,null,null,null,"Case 1","EA02O1",{"$f":"IF(EA!#REF!=\"Y\",\"X\",\"\")","v":{"$error":"#REF!"}}]
["LEED v4 BD+C: Homes","EA","P","Energy metering","EA102","x",{"$f":"EA!$J$30","v":0},0,null,null,null,"Case 2","EA02O2",{"$f":"IF(EA!#REF!=\"Y\",\"X\",\"\")","v":{"$error":"#REF!"}}]
["LEED v4 BD+C: Homes","EA","P","Education of homeowner, tenant, or building manager","EA103","x",{"$f":"EA!$J$39","v":0},0]
["LEED v4 BD+C: Homes","EA","C","Annual energy use","EA105",{"$f":"IF(EA!$J$48>0,\"X\",\"\")","v":"X"},{"$f":"EA!$J$48","v":""},29,null,null,null,"Option 1","EA05O1",{"$f":"IF(EA!$J$52>0,\"X\",\"\")","v":"X"}]
["LEED v4 BD+C: Homes","EA","C","Annual energy use","EA105",{"$f":"IF(EA!$J$48>0,\"X\",\"\")","v":"X"},{"$f":"EA!$J$48","v":""},29,null,null,null,"Option 1","EA05O1",{"$f":"IF(EA!$J$52>0,\"X\",\"\")","v":"X"},"1 point","EA05O1P1",{"$f":"IF(EA!$J$52=1,\"X\",\"\")","v":""}]
["LEED v4 BD+C: Homes","EA","C","Annual energy use","EA105",{"$f":"IF(EA!$J$48>0,\"X\",\"\")","v":"X"},{"$f":"EA!$J$48","v":""},29,null,null,null,"Option 1","EA05O1",{"$f":"IF(EA!$J$52>0,\"X\",\"\")","v":"X"},"2 points","EA05O1P2",{"$f":"IF(EA!$J$52=2,\"X\",\"\")","v":""}]
["LEED v4 BD+C: Homes","EA","C","Annual energy use","EA105",{"$f":"IF(EA!$J$48>0,\"X\",\"\")","v":"X"},{"$f":"EA!$J$48","v":""},29,null,null,null,"Option 1","EA05O1",{"$f":"IF(EA!$J$52>0,\"X\",\"\")","v":"X"},"3 points","EA05O1P3",{"$f":"IF(EA!$J$52=3,\"X\",\"\")","v":""}]
["LEED v4 BD+C: Homes","EA","C","Annual energy use","EA105",{"$f":"IF(EA!$J$48>0,\"X\",\"\")","v":"X"},{"$f":"EA!$J$48","v":""},29,null,null,null,"Option 1","EA05O1",{"$f":"IF(EA!$J$52>0,\"X\",\"\")","v":"X"},"4 points","EA05O1P4",{"$f":"IF(EA!$J$52=4,\"X\",\"\")","v":""}]
["LEED v4 BD+C: Homes","EA","C","Annual energy use","EA105",{"$f":"IF(EA!$J$48>0,\"X\",\"\")","v":"X"},{"$f":"EA!$J$48","v":""},29,null,null,null,"Option 1","EA05O1",{"$f":"IF(EA!$J$52>0,\"X\",\"\")","v":"X"},"5 points","EA05O1P5",{"$f":"IF(EA!$J$52=5,\"X\",\"\")","v":""}]
["LEED v4 BD+C: Homes","EA","C","Annual energy use","EA105",{"$f":"IF(EA!$J$48>0,\"X\",\"\")","v":"X"},{"$f":"EA!$J$48","v":""},29,null,null,null,"Option 1","EA05O1",{"$f":"IF(EA!$J$52>0,\"X\",\"\")","v":"X"},"6 points","EA05O1P6",{"$f":"IF(EA!$J$52=6,\"X\",\"\")","v":""}]
["LEED v4 BD+C: Homes","EA","C","Annual energy use","EA105",{"$f":"IF(EA!$J$48>0,\"X\",\"\")","v":"X"},{"$f":"EA!$J$48","v":""},29,null,null,null,"Option 1","EA05O1",{"$f":"IF(EA!$J$52>0,\"X\",\"\")","v":"X"},"7 points","EA05O1P7",{"$f":"IF(EA!$J$52=7,\"X\",\"\")","v":""}]
["LEED v4 BD+C: Homes","EA","C","Annual energy use","EA105",{"$f":"IF(EA!$J$48>0,\"X\",\"\")","v":"X"},{"$f":"EA!$J$48","v":""},29,null,null,null,"Option 1","EA05O1",{"$f":"IF(EA!$J$52>0,\"X\",\"\")","v":"X"},"8 points","EA05O1P8",{"$f":"IF(EA!$J$52=8,\"X\",\"\")","v":""}]
["LEED v4 BD+C: Homes","EA","C","Annual energy use","EA105",{"$f":"IF(EA!$J$48>0,\"X\",\"\")","v":"X"},{"$f":"EA!$J$48","v":""},29,null,null,null,"Option 1","EA05O1",{"$f":"IF(EA!$J$52>0,\"X\",\"\")","v":"X"},"9 points","EA05O1P9",{"$f":"IF(EA!$J$52=9,\"X\",\"\")","v":""}]
["LEED v4 BD+C: Homes","EA","C","Annual energy use","EA105",{"$f":"IF(EA!$J$48>0,\"X\",\"\")","v":"X"},{"$f":"EA!$J$48","v":""},29,null,null,null,"Option 1","EA05O1",{"$f":"IF(EA!$J$52>0,\"X\",\"\")","v":"X"},"10 points","EA05O1P10",{"$f":"IF(EA!$J$52=10,\"X\",\"\")","v":""}]
["LEED v4 BD+C: Homes","EA","C","Annual energy use","EA105",{"$f":"IF(EA!$J$48>0,\"X\",\"\")","v":"X"},{"$f":"EA!$J$48","v":""},29,null,null,null,"Option 1","EA05O1",{"$f":"IF(EA!$J$52>0,\"X\",\"\")","v":"X"},"11 points","EA05O1P11",{"$f":"IF(EA!$J$52=11,\"X\",\"\")","v":""}]
["LEED v4 BD+C: Homes","EA","C","Annual energy use","EA105",{"$f":"IF(EA!$J$48>0,\"X\",\"\")","v":"X"},{"$f":"EA!$J$48","v":""},29,null,null,null,"Option 1","EA05O1",{"$f":"IF(EA!$J$52>0,\"X\",\"\")","v":"X"},"12 points","EA05O1P12",{"$f":"IF(EA!$J$52=12,\"X\",\"\")","v":""}]
["LEED v4 BD+C: Homes","EA","C","Annual energy use","EA105",{"$f":"IF(EA!$J$48>0,\"X\",\"\")","v":"X"},{"$f":"EA!$J$48","v":""},29,null,null,null,"Option 1","EA05O1",{"$f":"IF(EA!$J$52>0,\"X\",\"\")","v":"X"},"13 points","EA05O1P13",{"$f":"IF(EA!$J$52=13,\"X\",\"\")","v":""}]
["LEED v4 BD+C: Homes","EA","C","Annual energy use","EA105",{"$f":"IF(EA!$J$48>0,\"X\",\"\")","v":"X"},{"$f":"EA!$J$48","v":""},29,null,null,null,"Option 1","EA05O1",{"$f":"IF(EA!$J$52>0,\"X\",\"\")","v":"X"},"14 points","EA05O1P14",{"$f":"IF(EA!$J$52=14,\"X\",\"\")","v":""}]
["LEED v4 BD+C: Homes","EA","C","Annual energy use","EA105",{"$f":"IF(EA!$J$48>0,\"X\",\"\")","v":"X"},{"$f":"EA!$J$48","v":""},29,null,null,null,"Option 1","EA05O1",{"$f":"IF(EA!$J$52>0,\"X\",\"\")","v":"X"},"15 points","EA05O1P15",{"$f":"IF(EA!$J$52=15,\"X\",\"\")","v":""}]
["LEED v4 BD+C: Homes","EA","C","Annual energy use","EA105",{"$f":"IF(EA!$J$48>0,\"X\",\"\")","v":"X"},{"$f":"EA!$J$48","v":""},29,null,null,null,"Option 1","EA05O1",{"$f":"IF(EA!$J$52>0,\"X\",\"\")","v":"X"},"16 points","EA05O1P16",{"$f":"IF(EA!$J$52=16,\"X\",\"\")","v":""}]
["LEED v4 BD+C: Homes","EA","C","Annual energy use","EA105",{"$f":"IF(EA!$J$48>0,\"X\",\"\")","v":"X"},{"$f":"EA!$J$48","v":""},29,null,null,null,"Option 1","EA05O1",{"$f":"IF(EA!$J$52>0,\"X\",\"\")","v":"X"},"17 points","EA05O1P17",{"$f":"IF(EA!$J$52=17,\"X\",\"\")","v":""}]
["LEED v4 BD+C: Homes","EA","C","Annual energy use","EA105",{"$f":"IF(EA!$J$48>0,\"X\",\"\")","v":"X"},{"$f":"EA!$J$48","v":""},29,null,null,null,"Option 1","EA05O1",{"$f":"IF(EA!$J$52>0,\"X\",\"\")","v":"X"},"18 points","EA05O1P18",{"$f":"IF(EA!$J$52=18,\"X\",\"\")","v":""}]
["LEED v4 BD+C: Homes","EA","C","Annual energy use","EA105",{"$f":"IF(EA!$J$48>0,\"X\",\"\")","v":"X"},{"$f":"EA!$J$48","v":""},29,null,null,null,"Option 1","EA05O1",{"$f":"IF(EA!$J$52>0,\"X\",\"\")","v":"X"},"19 points","EA05O1P19",{"$f":"IF(EA!$J$52=19,\"X\",\"\")","v":""}]
["LEED v4 BD+C: Homes","EA","C","Annual energy use","EA105",{"$f":"IF(EA!$J$48>0,\"X\",\"\")","v":"X"},{"$f":"EA!$J$48","v":""},29,null,null,null,"Option 1","EA05O1",{"$f":"IF(EA!$J$52>0,\"X\",\"\")","v":"X"},"20 points","EA05O1P20",{"$f":"IF(EA!$J$52=20,\"X\",\"\")","v":""}]
["LEED v4 BD+C: Homes","EA","C","Annual energy use","EA105",{"$f":"IF(EA!$J$48>0,\"X\",\"\")","v":"X"},{"$f":"EA!$J$48","v":""},29,null,null,null,"Option 1","EA05O1",{"$f":"IF(EA!$J$52>0,\"X\",\"\")","v":"X"},"21 points","EA05O1P21",{"$f":"IF(EA!$J$52=21,\"X\",\"\")","v":""}]
["LEED v4 BD+C: Homes","EA","C","Annual energy use","EA105",{"$f":"IF(EA!$J$48>0,\"X\",\"\")","v":"X"},{"$f":"EA!$J$48","v":""},29,null,null,null,"Option 1","EA05O1",{"$f":"IF(EA!$J$52>0,\"X\",\"\")","v":"X"},"22 points","EA05O1P22",{"$f":"IF(EA!$J$52=22,\"X\",\"\")","v":""}]
["LEED v4 BD+C: Homes","EA","C","Annual energy use","EA105",{"$f":"IF(EA!$J$48>0,\"X\",\"\")","v":"X"},{"$f":"EA!$J$48","v":""},29,null,null,null,"Option 1","EA05O1",{"$f":"IF(EA!$J$52>0,\"X\",\"\")","v":"X"},"23 points","EA05O1P23",{"$f":"IF(EA!$J$52=23,\"X\",\"\")","v":""}]
["LEED v4 BD+C: Homes","EA","C","Annual energy use","EA105",{"$f":"IF(EA!$J$48>0,\"X\",\"\")","v":"X"},{"$f":"EA!$J$48","v":""},29,null,null,null,"Option 1","EA05O1",{"$f":"IF(EA!$J$52>0,\"X\",\"\")","v":"X"},"24 points","EA05O1P24",{"$f":"IF(EA!$J$52=24,\"X\",\"\")","v":""}]
["LEED v4 BD+C: Homes","EA","C","Annual energy use","EA105",{"$f":"IF(EA!$J$48>0,\"X\",\"\")","v":"X"},{"$f":"EA!$J$48","v":""},29,null,null,null,"Option 1","EA05O1",{"$f":"IF(EA!$J$52>0,\"X\",\"\")","v":"X"},"25 points","EA05O1P25",{"$f":"IF(EA!$J$52=25,\"X\",\"\")","v":""}]
["LEED v4 BD+C: Homes","EA","C","Annual energy use","EA105",{"$f":"IF(EA!$J$48>0,\"X\",\"\")","v":"X"},{"$f":"EA!$J$48","v":""},29,null,null,null,"Option 1","EA05O1",{"$f":"IF(EA!$J$52>0,\"X\",\"\")","v":"X"},"26 points","EA05O1P26",{"$f":"IF(EA!$J$52=26,\"X\",\"\")","v":""}]
["LEED v4 BD+C: Homes","EA","C","Annual energy use","EA105",{"$f":"IF(EA!$J$48>0,\"X\",\"\")","v":"X"},{"$f":"EA!$J$48","v":""},29,null,null,null,"Option 1","EA05O1",{"$f":"IF(EA!$J$52>0,\"X\",\"\")","v":"X"},"27 points","EA05O1P27",{"$f":"IF(EA!$J$52=27,\"X\",\"\")","v":""}]
["LEED v4 BD+C: Homes","EA","C","Annual energy use","EA105",{"$f":"IF(EA!$J$48>0,\"X\",\"\")","v":"X"},{"$f":"EA!$J$48","v":""},29,null,null,null,"Option 1","EA05O1",{"$f":"IF(EA!$J$52>0,\"X\",\"\")","v":"X"},"28 points","EA05O1P28",{"$f":"IF(EA!$J$52=28,\"X\",\"\")","v":""}]
["LEED v4 BD+C: Homes","EA","C","Annual energy use","EA105",{"$f":"IF(EA!$J$48>0,\"X\",\"\")","v":"X"},{"$f":"EA!$J$48","v":""},29,null,null,null,"Option 1","EA05O1",{"$f":"IF(EA!$J$52>0,\"X\",\"\")","v":"X"},"29 points","EA05O1P29",{"$f":"IF(EA!$J$52=29,\"X\",\"\")","v":""}]
["LEED v4 BD+C: Homes","EA","C","Annual energy use","EA105",{"$f":"IF(EA!$J$48>0,\"X\",\"\")","v":"X"},{"$f":"EA!$J$48","v":""},29,null,null,null,"Option 2","EA05O2",{"$f":"IF(EA!$J$61>0,\"X\",\"\")","v":"X"}]
["LEED v4 BD+C: Homes","EA","C","Annual energy use","EA105",{"$f":"IF(EA!$J$48>0,\"X\",\"\")","v":"X"},{"$f":"EA!$J$48","v":""},29,null,null,null,"Option 2","EA05O2",{"$f":"IF(EA!$J$61>0,\"X\",\"\")","v":"X"},"0.5 points","EA05O2P1",{"$f":"IF(EA!$J$61=0.5,\"X\",\"\")","v":""}]
["LEED v4 BD+C: Homes","EA","C","Annual energy use","EA105",{"$f":"IF(EA!$J$48>0,\"X\",\"\")","v":"X"},{"$f":"EA!$J$48","v":""},29,null,null,null,"Option 2","EA05O2",{"$f":"IF(EA!$J$61>0,\"X\",\"\")","v":"X"},"1 point","EA05O2P2",{"$f":"IF(EA!$J$61=1,\"X\",\"\")","v":""}]
["LEED v4 BD+C: Homes","EA","C","Annual energy use","EA105",{"$f":"IF(EA!$J$48>0,\"X\",\"\")","v":"X"},{"$f":"EA!$J$48","v":""},29,null,null,null,"Option 2","EA05O2",{"$f":"IF(EA!$J$61>0,\"X\",\"\")","v":"X"},"1.5 points","EA05O2P3",{"$f":"IF(EA!$J$61=1.5,\"X\",\"\")","v":""}]
["LEED v4 BD+C: Homes","EA","C","Annual energy use","EA105",{"$f":"IF(EA!$J$48>0,\"X\",\"\")","v":"X"},{"$f":"EA!$J$48","v":""},29,null,null,null,"Option 2","EA05O2",{"$f":"IF(EA!$J$61>0,\"X\",\"\")","v":"X"},"2 points","EA05O2P4",{"$f":"IF(EA!$J$61=2,\"X\",\"\")","v":""}]
["LEED v4 BD+C: Homes","EA","C","Annual energy use","EA105",{"$f":"IF(EA!$J$48>0,\"X\",\"\")","v":"X"},{"$f":"EA!$J$48","v":""},29,null,null,null,"Option 2","EA05O2",{"$f":"IF(EA!$J$61>0,\"X\",\"\")","v":"X"},"2.5 points","EA05O2P5",{"$f":"IF(EA!$J$61=2.5,\"X\",\"\")","v":""}]
["LEED v4 BD+C: Homes","EA","C","Annual energy use","EA105",{"$f":"IF(EA!$J$48>0,\"X\",\"\")","v":"X"},{"$f":"EA!$J$48","v":""},29,null,null,null,"Option 2","EA05O2",{"$f":"IF(EA!$J$61>0,\"X\",\"\")","v":"X"},"3 points","EA05O2P6",{"$f":"IF(EA!$J$61=3,\"X\",\"\")","v":""}]
["LEED v4 BD+C: Homes","EA","C","Annual energy use","EA105",{"$f":"IF(EA!$J$48>0,\"X\",\"\")","v":"X"},{"$f":"EA!$J$48","v":""},29,null,null,null,"Option 2","EA05O2",{"$f":"IF(EA!$J$61>0,\"X\",\"\")","v":"X"},"3.5 points","EA05O2P7",{"$f":"IF(EA!$J$61=3.5,\"X\",\"\")","v":""}]
["LEED v4 BD+C: Homes","EA","C","Annual energy use","EA105",{"$f":"IF(EA!$J$48>0,\"X\",\"\")","v":"X"},{"$f":"EA!$J$48","v":""},29,null,null,null,"Option 2","EA05O2",{"$f":"IF(EA!$J$61>0,\"X\",\"\")","v":"X"},"4 points","EA05O2P8",{"$f":"IF(EA!$J$61=4,\"X\",\"\")","v":""}]
["LEED v4 BD+C: Homes","EA","C","Annual energy use","EA105",{"$f":"IF(EA!$J$48>0,\"X\",\"\")","v":"X"},{"$f":"EA!$J$48","v":""},29,null,null,null,"Option 2","EA05O2",{"$f":"IF(EA!$J$61>0,\"X\",\"\")","v":"X"},"4.5 points","EA05O2P9",{"$f":"IF(EA!$J$61=4.5,\"X\",\"\")","v":""}]
["LEED v4 BD+C: Homes","EA","C","Annual energy use","EA105",{"$f":"IF(EA!$J$48>0,\"X\",\"\")","v":"X"},{"$f":"EA!$J$48","v":""},29,null,null,null,"Option 2","EA05O2",{"$f":"IF(EA!$J$61>0,\"X\",\"\")","v":"X"},"5 points","EA05O2P10",{"$f":"IF(EA!$J$61=5,\"X\",\"\")","v":""}]
["LEED v4 BD+C: Homes","EA","C","Annual energy use","EA105",{"$f":"IF(EA!$J$48>0,\"X\",\"\")","v":"X"},{"$f":"EA!$J$48","v":""},29,null,null,null,"Option 2","EA05O2",{"$f":"IF(EA!$J$61>0,\"X\",\"\")","v":"X"},"5.5 points","EA05O2P11",{"$f":"IF(EA!$J$61=5.5,\"X\",\"\")","v":""}]
["LEED v4 BD+C: Homes","EA","C","Annual energy use","EA105",{"$f":"IF(EA!$J$48>0,\"X\",\"\")","v":"X"},{"$f":"EA!$J$48","v":""},29,null,null,null,"Option 2","EA05O2",{"$f":"IF(EA!$J$61>0,\"X\",\"\")","v":"X"},"6 points","EA05O2P12",{"$f":"IF(EA!$J$61=6,\"X\",\"\")","v":""}]
["LEED v4 BD+C: Homes","EA","C","Annual energy use","EA105",{"$f":"IF(EA!$J$48>0,\"X\",\"\")","v":"X"},{"$f":"EA!$J$48","v":""},29,null,null,null,"Option 2","EA05O2",{"$f":"IF(EA!$J$61>0,\"X\",\"\")","v":"X"},"6.5 points","EA05O2P13",{"$f":"IF(EA!$J$61=6.5,\"X\",\"\")","v":""}]
["LEED v4 BD+C: Homes","EA","C","Annual energy use","EA105",{"$f":"IF(EA!$J$48>0,\"X\",\"\")","v":"X"},{"$f":"EA!$J$48","v":""},29,null,null,null,"Option 2","EA05O2",{"$f":"IF(EA!$J$61>0,\"X\",\"\")","v":"X"},"7 points","EA05O2P14",{"$f":"IF(EA!$J$61=7,\"X\",\"\")","v":""}]
["LEED v4 BD+C: Homes","EA","C","Annual energy use","EA105",{"$f":"IF(EA!$J$48>0,\"X\",\"\")","v":"X"},{"$f":"EA!$J$48","v":""},29,null,null,null,"Option 2","EA05O2",{"$f":"IF(EA!$J$61>0,\"X\",\"\")","v":"X"},"7.5 points","EA05O2P15",{"$f":"IF(EA!$J$61=7.5,\"X\",\"\")","v":""}]
["LEED v4 BD+C: Homes","EA","C","Annual energy use","EA105",{"$f":"IF(EA!$J$48>0,\"X\",\"\")","v":"X"},{"$f":"EA!$J$48","v":""},29,null,null,null,"Option 2","EA05O2",{"$f":"IF(EA!$J$61>0,\"X\",\"\")","v":"X"},"8 points","EA05O2P16",{"$f":"IF(EA!$J$61=8,\"X\",\"\")","v":""}]
["LEED v4 BD+C: Homes","EA","C","Annual energy use","EA105",{"$f":"IF(EA!$J$48>0,\"X\",\"\")","v":"X"},{"$f":"EA!$J$48","v":""},29,null,null,null,"Option 2","EA05O2",{"$f":"IF(EA!$J$61>0,\"X\",\"\")","v":"X"},"8.5 points","EA05O2P17",{"$f":"IF(EA!$J$61=8.5,\"X\",\"\")","v":""}]
["LEED v4 BD+C: Homes","EA","C","Annual energy use","EA105",{"$f":"IF(EA!$J$48>0,\"X\",\"\")","v":"X"},{"$f":"EA!$J$48","v":""},29,null,null,null,"Option 2","EA05O2",{"$f":"IF(EA!$J$61>0,\"X\",\"\")","v":"X"},"9 points","EA05O2P18",{"$f":"IF(EA!$J$61=9,\"X\",\"\")","v":""}]
["LEED v4 BD+C: Homes","EA","C","Annual energy use","EA105",{"$f":"IF(EA!$J$48>0,\"X\",\"\")","v":"X"},{"$f":"EA!$J$48","v":""},29,null,null,null,"Option 2","EA05O2",{"$f":"IF(EA!$J$61>0,\"X\",\"\")","v":"X"},"9.5 points","EA05O2P19",{"$f":"IF(EA!$J$61=9.5,\"X\",\"\")","v":""}]
["LEED v4 BD+C: Homes","EA","C","Annual energy use","EA105",{"$f":"IF(EA!$J$48>0,\"X\",\"\")","v":"X"},{"$f":"EA!$J$48","v":""},29,null,null,null,"Option 2","EA05O2",{"$f":"IF(EA!$J$61>0,\"X\",\"\")","v":"X"},"10 points","EA05O2P20",{"$f":"IF(EA!$J$61=10,\"X\",\"\")","v":""}]
["LEED v4 BD+C: Homes","EA","C","Annual energy use","EA105",{"$f":"IF(EA!$J$48>0,\"X\",\"\")","v":"X"},{"$f":"EA!$J$48","v":""},29,null,null,null,"Option 2","EA05O2",{"$f":"IF(EA!$J$61>0,\"X\",\"\")","v":"X"},"10.5 points","EA05O2P21",{"$f":"IF(EA!$J$61=10.5,\"X\",\"\")","v":""}]
["LEED v4 BD+C: Homes","EA","C","Annual energy use","EA105",{"$f":"IF(EA!$J$48>0,\"X\",\"\")","v":"X"},{"$f":"EA!$J$48","v":""},29,null,null,null,"Option 2","EA05O2",{"$f":"IF(EA!$J$61>0,\"X\",\"\")","v":"X"},"11 points","EA05O2P22",{"$f":"IF(EA!$J$61=11,\"X\",\"\")","v":""}]
["LEED v4 BD+C: Homes","EA","C","Annual energy use","EA105",{"$f":"IF(EA!$J$48>0,\"X\",\"\")","v":"X"},{"$f":"EA!$J$48","v":""},29,null,null,null,"Option 2","EA05O2",{"$f":"IF(EA!$J$61>0,\"X\",\"\")","v":"X"},"11.5 points","EA05O2P23",{"$f":"IF(EA!$J$61=11.5,\"X\",\"\")","v":""}]
["LEED v4 BD+C: Homes","EA","C","Annual energy use","EA105",{"$f":"IF(EA!$J$48>0,\"X\",\"\")","v":"X"},{"$f":"EA!$J$48","v":""},29,null,null,null,"Option 2","EA05O2",{"$f":"IF(EA!$J$61>0,\"X\",\"\")","v":"X"},"12 points","EA05O2P24",{"$f":"IF(EA!$J$61=12,\"X\",\"\")","v":""}]
["LEED v4 BD+C: Homes","EA","C","Annual energy use","EA105",{"$f":"IF(EA!$J$48>0,\"X\",\"\")","v":"X"},{"$f":"EA!$J$48","v":""},29,null,null,null,"Option 2","EA05O2",{"$f":"IF(EA!$J$61>0,\"X\",\"\")","v":"X"},"12.5 points","EA05O2P25",{"$f":"IF(EA!$J$61=12.5,\"X\",\"\")","v":""}]
["LEED v4 BD+C: Homes","EA","C","Annual energy use","EA105",{"$f":"IF(EA!$J$48>0,\"X\",\"\")","v":"X"},{"$f":"EA!$J$48","v":""},29,null,null,null,"Option 2","EA05O2",{"$f":"IF(EA!$J$61>0,\"X\",\"\")","v":"X"},"13 points","EA05O2P26",{"$f":"IF(EA!$J$61=13,\"X\",\"\")","v":""}]
["LEED v4 BD+C: Homes","EA","C","Annual energy use","EA105",{"$f":"IF(EA!$J$48>0,\"X\",\"\")","v":"X"},{"$f":"EA!$J$48","v":""},29,null,null,null,"Option 2","EA05O2",{"$f":"IF(EA!$J$61>0,\"X\",\"\")","v":"X"},"13.5 points","EA05O2P27",{"$f":"IF(EA!$J$61=13.5,\"X\",\"\")","v":""}]
["LEED v4 BD+C: Homes","EA","C","Annual energy use","EA105",{"$f":"IF(EA!$J$48>0,\"X\",\"\")","v":"X"},{"$f":"EA!$J$48","v":""},29,null,null,null,"Option 2","EA05O2",{"$f":"IF(EA!$J$61>0,\"X\",\"\")","v":"X"},"14 points","EA05O2P28",{"$f":"IF(EA!$J$61=14,\"X\",\"\")","v":""}]
["LEED v4 BD+C: Homes","EA","C","Annual energy use","EA105",{"$f":"IF(EA!$J$48>0,\"X\",\"\")","v":"X"},{"$f":"EA!$J$48","v":""},29,null,null,null,"Option 2","EA05O2",{"$f":"IF(EA!$J$61>0,\"X\",\"\")","v":"X"},"14.5 points","EA05O2P29",{"$f":"IF(EA!$J$61=14.5,\"X\",\"\")","v":""}]
["LEED v4 BD+C: Homes","EA","C","Annual energy use","EA105",{"$f":"IF(EA!$J$48>0,\"X\",\"\")","v":"X"},{"$f":"EA!$J$48","v":""},29,null,null,null,"Option 2","EA05O2",{"$f":"IF(EA!$J$61>0,\"X\",\"\")","v":"X"},"15 points","EA05O2P30",{"$f":"IF(EA!$J$61=15,\"X\",\"\")","v":""}]
["LEED v4 BD+C: Homes","EA","C","Annual energy use","EA105",{"$f":"IF(EA!$J$48>0,\"X\",\"\")","v":"X"},{"$f":"EA!$J$48","v":""},29,null,null,null,"Option 2","EA05O2",{"$f":"IF(EA!$J$61>0,\"X\",\"\")","v":"X"},"15.5 points","EA05O2P31",{"$f":"IF(EA!$J$61=15.5,\"X\",\"\")","v":""}]
["LEED v4 BD+C: Homes","EA","C","Annual energy use","EA105",{"$f":"IF(EA!$J$48>0,\"X\",\"\")","v":"X"},{"$f":"EA!$J$48","v":""},29,null,null,null,"Option 2","EA05O2",{"$f":"IF(EA!$J$61>0,\"X\",\"\")","v":"X"},"16 points","EA05O2P32",{"$f":"IF(EA!$J$61=16,\"X\",\"\")","v":""}]
["LEED v4 BD+C: Homes","EA","C","Annual energy use","EA105",{"$f":"IF(EA!$J$48>0,\"X\",\"\")","v":"X"},{"$f":"EA!$J$48","v":""},29,null,null,null,"Option 2","EA05O2",{"$f":"IF(EA!$J$61>0,\"X\",\"\")","v":"X"},"16.5 points","EA05O2P33",{"$f":"IF(EA!$J$61=16.5,\"X\",\"\")","v":""}]
["LEED v4 BD+C: Homes","EA","C","Annual energy use","EA105",{"$f":"IF(EA!$J$48>0,\"X\",\"\")","v":"X"},{"$f":"EA!$J$48","v":""},29,null,null,null,"Option 2","EA05O2",{"$f":"IF(EA!$J$61>0,\"X\",\"\")","v":"X"},"17 points","EA05O2P34",{"$f":"IF(EA!$J$61=17,\"X\",\"\")","v":""}]
["LEED v4 BD+C: Homes","EA","C","Annual energy use","EA105",{"$f":"IF(EA!$J$48>0,\"X\",\"\")","v":"X"},{"$f":"EA!$J$48","v":""},29,null,null,null,"Option 2","EA05O2",{"$f":"IF(EA!$J$61>0,\"X\",\"\")","v":"X"},"17.5 points","EA05O2P35",{"$f":"IF(EA!$J$61=17.5,\"X\",\"\")","v":""}]
["LEED v4 BD+C: Homes","EA","C","Annual energy use","EA105",{"$f":"IF(EA!$J$48>0,\"X\",\"\")","v":"X"},{"$f":"EA!$J$48","v":""},29,null,null,null,"Option 2","EA05O2",{"$f":"IF(EA!$J$61>0,\"X\",\"\")","v":"X"},"18 points","EA05O2P36",{"$f":"IF(EA!$J$61=18,\"X\",\"\")","v":""}]
["LEED v4 BD+C: Homes","EA","C","Annual energy use","EA105",{"$f":"IF(EA!$J$48>0,\"X\",\"\")","v":"X"},{"$f":"EA!$J$48","v":""},29,null,null,null,"Option 2","EA05O2",{"$f":"IF(EA!$J$61>0,\"X\",\"\")","v":"X"},"18.5 points","EA05O2P37",{"$f":"IF(EA!$J$61=18.5,\"X\",\"\")","v":""}]
["LEED v4 BD+C: Homes","EA","C","Annual energy use","EA105",{"$f":"IF(EA!$J$48>0,\"X\",\"\")","v":"X"},{"$f":"EA!$J$48","v":""},29,null,null,null,"Option 2","EA05O2",{"$f":"IF(EA!$J$61>0,\"X\",\"\")","v":"X"},"19 points","EA05O2P38",{"$f":"IF(EA!$J$61=19,\"X\",\"\")","v":""}]
["LEED v4 BD+C: Homes","EA","C","Annual energy use","EA105",{"$f":"IF(EA!$J$48>0,\"X\",\"\")","v":"X"},{"$f":"EA!$J$48","v":""},29,null,null,null,"Option 2","EA05O2",{"$f":"IF(EA!$J$61>0,\"X\",\"\")","v":"X"},"19.5 points","EA05O2P39",{"$f":"IF(EA!$J$61=19.5,\"X\",\"\")","v":""}]
["LEED v4 BD+C: Homes","EA","C","Annual energy use","EA105",{"$f":"IF(EA!$J$48>0,\"X\",\"\")","v":"X"},{"$f":"EA!$J$48","v":""},29,null,null,null,"Option 2","EA05O2",{"$f":"IF(EA!$J$61>0,\"X\",\"\")","v":"X"},"20 points","EA05O2P40",{"$f":"IF(EA!$J$61=20,\"X\",\"\")","v":""}]
["LEED v4 BD+C: Homes","EA","C","Annual energy use","EA105",{"$f":"IF(EA!$J$48>0,\"X\",\"\")","v":"X"},{"$f":"EA!$J$48","v":""},29,null,null,null,"Option 2","EA05O2",{"$f":"IF(EA!$J$61>0,\"X\",\"\")","v":"X"},"20.5 points","EA05O2P41",{"$f":"IF(EA!$J$61=20.5,\"X\",\"\")","v":""}]
["LEED v4 BD+C: Homes","EA","C","Annual energy use","EA105",{"$f":"IF(EA!$J$48>0,\"X\",\"\")","v":"X"},{"$f":"EA!$J$48","v":""},29,null,null,null,"Option 2","EA05O2",{"$f":"IF(EA!$J$61>0,\"X\",\"\")","v":"X"},"21 points","EA05O2P42",{"$f":"IF(EA!$J$61=21,\"X\",\"\")","v":""}]
["LEED v4 BD+C: Homes","EA","C","Annual energy use","EA105",{"$f":"IF(EA!$J$48>0,\"X\",\"\")","v":"X"},{"$f":"EA!$J$48","v":""},29,null,null,null,"Option 2","EA05O2",{"$f":"IF(EA!$J$61>0,\"X\",\"\")","v":"X"},"21.5 points","EA05O2P43",{"$f":"IF(EA!$J$61=21.5,\"X\",\"\")","v":""}]
["LEED v4 BD+C: Homes","EA","C","Annual energy use","EA105",{"$f":"IF(EA!$J$48>0,\"X\",\"\")","v":"X"},{"$f":"EA!$J$48","v":""},29,null,null,null,"Option 2","EA05O2",{"$f":"IF(EA!$J$61>0,\"X\",\"\")","v":"X"},"22 points","EA05O2P44",{"$f":"IF(EA!$J$61=22,\"X\",\"\")","v":""}]
["LEED v4 BD+C: Homes","EA","C","Annual energy use","EA105",{"$f":"IF(EA!$J$48>0,\"X\",\"\")","v":"X"},{"$f":"EA!$J$48","v":""},29,null,null,null,"Option 2","EA05O2",{"$f":"IF(EA!$J$61>0,\"X\",\"\")","v":"X"},"22.5 points","EA05O2P45",{"$f":"IF(EA!$J$61=22.5,\"X\",\"\")","v":""}]
["LEED v4 BD+C: Homes","EA","C","Annual energy use","EA105",{"$f":"IF(EA!$J$48>0,\"X\",\"\")","v":"X"},{"$f":"EA!$J$48","v":""},29,null,null,null,"Option 2","EA05O2",{"$f":"IF(EA!$J$61>0,\"X\",\"\")","v":"X"},"23 points","EA05O2P46",{"$f":"IF(EA!$J$61=23,\"X\",\"\")","v":""}]
["LEED v4 BD+C: Homes","EA","C","Annual energy use","EA105",{"$f":"IF(EA!$J$48>0,\"X\",\"\")","v":"X"},{"$f":"EA!$J$48","v":""},29,null,null,null,"Option 2","EA05O2",{"$f":"IF(EA!$J$61>0,\"X\",\"\")","v":"X"},"23.5 points","EA05O2P47",{"$f":"IF(EA!$J$61=23.5,\"X\",\"\")","v":""}]
["LEED v4 BD+C: Homes","EA","C","Annual energy use","EA105",{"$f":"IF(EA!$J$48>0,\"X\",\"\")","v":"X"},{"$f":"EA!$J$48","v":""},29,null,null,null,"Option 2","EA05O2",{"$f":"IF(EA!$J$61>0,\"X\",\"\")","v":"X"},"24 points","EA05O2P48",{"$f":"IF(EA!$J$61=24,\"X\",\"\")","v":""}]
["LEED v4 BD+C: Homes","EA","C","Annual energy use","EA105",{"$f":"IF(EA!$J$48>0,\"X\",\"\")","v":"X"},{"$f":"EA!$J$48","v":""},29,null,null,null,"Option 2","EA05O2",{"$f":"IF(EA!$J$61>0,\"X\",\"\")","v":"X"},"24.5 points","EA05O2P49",{"$f":"IF(EA!$J$61=24.5,\"X\",\"\")","v":""}]
["LEED v4 BD+C: Homes","EA","C","Annual energy use","EA105",{"$f":"IF(EA!$J$48>0,\"X\",\"\")","v":"X"},{"$f":"EA!$J$48","v":""},29,null,null,null,"Option 2","EA05O2",{"$f":"IF(EA!$J$61>0,\"X\",\"\")","v":"X"},"25 points","EA05O2P50",{"$f":"IF(EA!$J$61=25,\"X\",\"\")","v":""}]
["LEED v4 BD+C: Homes","EA","C","Annual energy use","EA105",{"$f":"IF(EA!$J$48>0,\"X\",\"\")","v":"X"},{"$f":"EA!$J$48","v":""},29,null,null,null,"Option 2","EA05O2",{"$f":"IF(EA!$J$61>0,\"X\",\"\")","v":"X"},"25.5 points","EA05O2P51",{"$f":"IF(EA!$J$61=25.5,\"X\",\"\")","v":""}]
["LEED v4 BD+C: Homes","EA","C","Annual energy use","EA105",{"$f":"IF(EA!$J$48>0,\"X\",\"\")","v":"X"},{"$f":"EA!$J$48","v":""},29,null,null,null,"Option 2","EA05O2",{"$f":"IF(EA!$J$61>0,\"X\",\"\")","v":"X"},"26 points","EA05O2P52",{"$f":"IF(EA!$J$61=26,\"X\",\"\")","v":""}]
["LEED v4 BD+C: Homes","EA","C","Annual energy use","EA105",{"$f":"IF(EA!$J$48>0,\"X\",\"\")","v":"X"},{"$f":"EA!$J$48","v":""},29,null,null,null,"Option 2","EA05O2",{"$f":"IF(EA!$J$61>0,\"X\",\"\")","v":"X"},"26.5 points","EA05O2P53",{"$f":"IF(EA!$J$61=26.5,\"X\",\"\")","v":""}]
["LEED v4 BD+C: Homes","EA","C","Annual energy use","EA105",{"$f":"IF(EA!$J$48>0,\"X\",\"\")","v":"X"},{"$f":"EA!$J$48","v":""},29,null,null,null,"Option 2","EA05O2",{"$f":"IF(EA!$J$61>0,\"X\",\"\")","v":"X"},"27 points","EA05O2P54",{"$f":"IF(EA!$J$61=27,\"X\",\"\")","v":""}]
["LEED v4 BD+C: Homes","EA","C","Annual energy use","EA105",{"$f":"IF(EA!$J$48>0,\"X\",\"\")","v":"X"},{"$f":"EA!$J$48","v":""},29,null,null,null,"Option 2","EA05O2",{"$f":"IF(EA!$J$61>0,\"X\",\"\")","v":"X"},"27.5 points","EA05O2P55",{"$f":"IF(EA!$J$61=27.5,\"X\",\"\")","v":""}]
["LEED v4 BD+C: Homes","EA","C","Annual energy use","EA105",{"$f":"IF(EA!$J$48>0,\"X\",\"\")","v":"X"},{"$f":"EA!$J$48","v":""},29,null,null,null,"Option 2","EA05O2",{"$f":"IF(EA!$J$61>0,\"X\",\"\")","v":"X"},"28 points","EA05O2P56",{"$f":"IF(EA!$J$61=28,\"X\",\"\")","v":""}]
["LEED v4 BD+C: Homes","EA","C","Annual energy use","EA105",{"$f":"IF(EA!$J$48>0,\"X\",\"\")","v":"X"},{"$f":"EA!$J$48","v":""},29,null,null,null,"Option 2","EA05O2",{"$f":"IF(EA!$J$61>0,\"X\",\"\")","v":"X"},"28.5 points","EA05O2P57",{"$f":"IF(EA!$J$61=28.5,\"X\",\"\")","v":""}]
["LEED v4 BD+C: Homes","EA","C","Annual energy use","EA105",{"$f":"IF(EA!$J$48>0,\"X\",\"\")","v":"X"},{"$f":"EA!$J$48","v":""},29,null,null,null,"Option 2","EA05O2",{"$f":"IF(EA!$J$61>0,\"X\",\"\")","v":"X"},"29 points","EA05O2P58",{"$f":"IF(EA!$J$61>=29,\"X\",\"\")","v":"X"}]
["LEED v4 BD+C: Homes","EA","C","Efficient hot water distribution system","EA106",{"$f":"IF(EA!$J$86>0,\"X\",\"\")","v":""},{"$f":"EA!$J$86","v":0},5,null,null,null,"Option 1","EA06O1",{"$f":"IF(EA!$J$89>0,\"X\",\"\")","v":""}]
["LEED v4 BD+C: Homes","EA","C","Efficient hot water distribution system","EA106",{"$f":"IF(EA!$J$86>0,\"X\",\"\")","v":""},{"$f":"EA!$J$86","v":0},5,null,null,null,"Option 1","EA06O1",{"$f":"IF(EA!$J$89>0,\"X\",\"\")","v":""},"Path 1","EA06O1P1",{"$f":"IF(EA!$J$107>0,\"X\",\"\")","v":""}]
["LEED v4 BD+C: Homes","EA","C","Efficient hot water distribution system","EA106",{"$f":"IF(EA!$J$86>0,\"X\",\"\")","v":""},{"$f":"EA!$J$86","v":0},5,null,null,null,"Option 1","EA06O1",{"$f":"IF(EA!$J$89>0,\"X\",\"\")","v":""},"Path 2","EA06O1P2",{"$f":"IF(EA!$J$117>0,\"X\",\"\")","v":""}]
["LEED v4 BD+C: Homes","EA","C","Efficient hot water distribution system","EA106",{"$f":"IF(EA!$J$86>0,\"X\",\"\")","v":""},{"$f":"EA!$J$86","v":0},5,null,null,null,"Option 2","EA06O2",{"$f":"IF(EA!$J$123>0,\"X\",\"\")","v":""}]
["LEED v4 BD+C: Homes","EA","C","Efficient hot water distribution system","EA106",{"$f":"IF(EA!$J$86>0,\"X\",\"\")","v":""},{"$f":"EA!$J$86","v":0},5,null,null,null,"Option 2","EA06O2",{"$f":"IF(EA!$J$123>0,\"X\",\"\")","v":""},"Case 1","EA06O2P1",{"$f":"IF(EA!$J$142>0,\"X\",\"\")","v":""}]
["LEED v4 BD+C: Homes","EA","C","Efficient hot water distribution system","EA106",{"$f":"IF(EA!$J$86>0,\"X\",\"\")","v":""},{"$f":"EA!$J$86","v":0},5,null,null,null,"Option 2","EA06O2",{"$f":"IF(EA!$J$123>0,\"X\",\"\")","v":""},"Case 2","EA06O2P2",{"$f":"IF(EA!$J$150>0,\"X\",\"\")","v":""}]
["LEED v4 BD+C: Homes","EA","C","Efficient hot water distribution system","EA106",{"$f":"IF(EA!$J$86>0,\"X\",\"\")","v":""},{"$f":"EA!$J$86","v":0},5,null,null,null,"Option 3","EA06O3",{"$f":"IF(EA!$J$159>0,\"X\",\"\")","v":""}]
["LEED v4 BD+C: Homes","EA","C","Advanced utility tracking","EA108",{"$f":"IF(EA!#REF!>0,\"X\",\"\")","v":{"$error":"#REF!"}},{"$f":"EA!#REF!","v":{"$error":"#REF!"}},2,null,null,null,"Case 1, Option 1","EA08O1",{"$f":"IF(EA!#REF!>0,\"X\",\"\")","v":{"$error":"#REF!"}}]
["LEED v4 BD+C: Homes","EA","C","Advanced utility tracking","EA108",{"$f":"IF(EA!#REF!>0,\"X\",\"\")","v":{"$error":"#REF!"}},{"$f":"EA!#REF!","v":{"$error":"#REF!"}},2,null,null,null,"Case 1, Option 2","EA08O2",{"$f":"IF(EA!#REF!>0,\"X\",\"\")","v":{"$error":"#REF!"}}]
["LEED v4 BD+C: Homes","EA","C","Advanced utility tracking","EA108",{"$f":"IF(EA!#REF!>0,\"X\",\"\")","v":{"$error":"#REF!"}},{"$f":"EA!#REF!","v":{"$error":"#REF!"}},2,null,null,null,"Case 2, Option 1","EA08O3",{"$f":"IF(EA!#REF!>0,\"X\",\"\")","v":{"$error":"#REF!"}}]
["LEED v4 BD+C: Homes","EA","C","Advanced utility tracking","EA108",{"$f":"IF(EA!#REF!>0,\"X\",\"\")","v":{"$error":"#REF!"}},{"$f":"EA!#REF!","v":{"$error":"#REF!"}},2,null,null,null,"Case 2, Option 2","EA08O4",{"$f":"IF(EA!#REF!>0,\"X\",\"\")","v":{"$error":"#REF!"}}]
["LEED v4 BD+C: Homes","EA","C","Advanced utility tracking","EA108",{"$f":"IF(EA!#REF!>0,\"X\",\"\")","v":{"$error":"#REF!"}},{"$f":"EA!#REF!","v":{"$error":"#REF!"}},2,null,null,null,"Case 2, Option 2","EA08O4",{"$f":"IF(EA!#REF!>0,\"X\",\"\")","v":{"$error":"#REF!"}},"Path 1","EA08O4P1",{"$f":"IF(EA!#REF!>0,\"X\",\"\")","v":{"$error":"#REF!"}}]
["LEED v4 BD+C: Homes","EA","C","Advanced utility tracking","EA108",{"$f":"IF(EA!#REF!>0,\"X\",\"\")","v":{"$error":"#REF!"}},{"$f":"EA!#REF!","v":{"$error":"#REF!"}},2,null,null,null,"Case 2, Option 2","EA08O4",{"$f":"IF(EA!#REF!>0,\"X\",\"\")","v":{"$error":"#REF!"}},"Path 2","EA08O4P2",{"$f":"IF(EA!#REF!>0,\"X\",\"\")","v":{"$error":"#REF!"}}]
["LEED v4 BD+C: Homes","EA","C","Active solar-ready design","EA109",{"$f":"IF(EA!#REF!>0,\"X\",\"\")","v":{"$error":"#REF!"}},{"$f":"EA!#REF!","v":{"$error":"#REF!"}},1,null,null,null,"Option  1","EA09O1",{"$f":"IF(EA!#REF!>0,\"X\",\"\")","v":{"$error":"#REF!"}}]
["LEED v4 BD+C: Homes","EA","C","Active solar-ready design","EA109",{"$f":"IF(EA!#REF!>0,\"X\",\"\")","v":{"$error":"#REF!"}},{"$f":"EA!#REF!","v":{"$error":"#REF!"}},1,null,null,null,"Option  2","EA09O2",{"$f":"IF(EA!#REF!>0,\"X\",\"\")","v":{"$error":"#REF!"}}]
["LEED v4 BD+C: Homes","EA","C","HVAC start-up credentialing","EA110",{"$f":"IF(EA!$J$166>0,\"X\",\"\")","v":""},{"$f":"EA!$J$166","v":0},1]
["LEED v4 BD+C: Homes","EA","P","Home Size","EA111","x",{"$f":"EA!#REF!","v":{"$error":"#REF!"}},38,"Prerequisite","EA11T1",{"$f":"IF(G200=0,\"X\",\"\")","v":{"$error":"#REF!"}}]
["LEED v4 BD+C: Homes","EA","P","Home Size","EA111","x",{"$f":"EA!#REF!","v":{"$error":"#REF!"}},38,"0.5 points","EA11T2",{"$f":"IF(G201=0.5,\"X\",\"\")","v":{"$error":"#REF!"}}]
["LEED v4 BD+C: Homes","EA","P","Home Size","EA111","x",{"$f":"EA!#REF!","v":{"$error":"#REF!"}},38,"1 point","EA11T3",{"$f":"IF(G202=1,\"X\",\"\")","v":{"$error":"#REF!"}}]
["LEED v4 BD+C: Homes","EA","P","Home Size","EA111","x",{"$f":"EA!#REF!","v":{"$error":"#REF!"}},38,"1.5 points","EA11T4",{"$f":"IF(G203=1.5,\"X\",\"\")","v":{"$error":"#REF!"}}]
["LEED v4 BD+C: Homes","EA","P","Home Size","EA111","x",{"$f":"EA!#REF!","v":{"$error":"#REF!"}},38,"2 points","EA11T5",{"$f":"IF(G204=2,\"X\",\"\")","v":{"$error":"#REF!"}}]
["LEED v4 BD+C: Homes","EA","P","Home Size","EA111","x",{"$f":"EA!#REF!","v":{"$error":"#REF!"}},38,"2.5 points","EA11T6",{"$f":"IF(G205=2.5,\"X\",\"\")","v":{"$error":"#REF!"}}]
["LEED v4 BD+C: Homes","EA","P","Home Size","EA111","x",{"$f":"EA!#REF!","v":{"$error":"#REF!"}},38,"3 points","EA11T7",{"$f":"IF(G206=3,\"X\",\"\")","v":{"$error":"#REF!"}}]
["LEED v4 BD+C: Homes","EA","P","Home Size","EA111","x",{"$f":"EA!#REF!","v":{"$error":"#REF!"}},38,"3.5 points","EA11T8",{"$f":"IF(G207=3.5,\"X\",\"\")","v":{"$error":"#REF!"}}]
["LEED v4 BD+C: Homes","EA","P","Home Size","EA111","x",{"$f":"EA!#REF!","v":{"$error":"#REF!"}},38,"4 points","EA11T9",{"$f":"IF(G208=4,\"X\",\"\")","v":{"$error":"#REF!"}}]
["LEED v4 BD+C: Homes","EA","P","Home Size","EA111","x",{"$f":"EA!#REF!","v":{"$error":"#REF!"}},38,"4.5 points","EA11T10",{"$f":"IF(G209=4.5,\"X\",\"\")","v":{"$error":"#REF!"}}]
["LEED v4 BD+C: Homes","EA","P","Home Size","EA111","x",{"$f":"EA!#REF!","v":{"$error":"#REF!"}},38,"5 points","EA11T11",{"$f":"IF(G210=5,\"X\",\"\")","v":{"$error":"#REF!"}}]
["LEED v4 BD+C: Homes","EA","P","Home Size","EA111","x",{"$f":"EA!#REF!","v":{"$error":"#REF!"}},38,"5.5 points","EA11T12",{"$f":"IF(G211=5.5,\"X\",\"\")","v":{"$error":"#REF!"}}]
["LEED v4 BD+C: Homes","EA","P","Home Size","EA111","x",{"$f":"EA!#REF!","v":{"$error":"#REF!"}},38,"6 points","EA11T13",{"$f":"IF(G212=6,\"X\",\"\")","v":{"$error":"#REF!"}}]
["LEED v4 BD+C: Homes","EA","P","Home Size","EA111","x",{"$f":"EA!#REF!","v":{"$error":"#REF!"}},38,"6.5 points","EA11T14",{"$f":"IF(G213=6.5,\"X\",\"\")","v":{"$error":"#REF!"}}]
["LEED v4 BD+C: Homes","EA","P","Home Size","EA111","x",{"$f":"EA!#REF!","v":{"$error":"#REF!"}},38,"7 points","EA11T15",{"$f":"IF(G214=7,\"X\",\"\")","v":{"$error":"#REF!"}}]
["LEED v4 BD+C: Homes","EA","P","Home Size","EA111","x",{"$f":"EA!#REF!","v":{"$error":"#REF!"}},38,"7.5 points","EA11T16",{"$f":"IF(G215=7.5,\"X\",\"\")","v":{"$error":"#REF!"}}]
["LEED v4 BD+C: Homes","EA","P","Home Size","EA111","x",{"$f":"EA!#REF!","v":{"$error":"#REF!"}},38,"8 points","EA11T17",{"$f":"IF(G216=8,\"X\",\"\")","v":{"$error":"#REF!"}}]
["LEED v4 BD+C: Homes","EA","P","Home Size","EA111","x",{"$f":"EA!#REF!","v":{"$error":"#REF!"}},38,"8.5 points","EA11T18",{"$f":"IF(G217=8.5,\"X\",\"\")","v":{"$error":"#REF!"}}]
["LEED v4 BD+C: Homes","EA","P","Home Size","EA111","x",{"$f":"EA!#REF!","v":{"$error":"#REF!"}},38,"9 points","EA11T19",{"$f":"IF(G218=9,\"X\",\"\")","v":{"$error":"#REF!"}}]
["LEED v4 BD+C: Homes","EA","P","Home Size","EA111","x",{"$f":"EA!#REF!","v":{"$error":"#REF!"}},38,"9.5 points","EA11T20",{"$f":"IF(G219=9.5,\"X\",\"\")","v":{"$error":"#REF!"}}]
["LEED v4 BD+C: Homes","EA","P","Home Size","EA111","x",{"$f":"EA!#REF!","v":{"$error":"#REF!"}},38,"10 points","EA11T21",{"$f":"IF(G220=10,\"X\",\"\")","v":{"$error":"#REF!"}}]
["LEED v4 BD+C: Homes","EA","P","Home Size","EA111","x",{"$f":"EA!#REF!","v":{"$error":"#REF!"}},38,"10.5 points","EA11T22",{"$f":"IF(G221=10.5,\"X\",\"\")","v":{"$error":"#REF!"}}]
["LEED v4 BD+C: Homes","EA","P","Home Size","EA111","x",{"$f":"EA!#REF!","v":{"$error":"#REF!"}},38,"11 points","EA11T23",{"$f":"IF(G222=11,\"X\",\"\")","v":{"$error":"#REF!"}}]
["LEED v4 BD+C: Homes","EA","P","Home Size","EA111","x",{"$f":"EA!#REF!","v":{"$error":"#REF!"}},38,"11.5 points","EA11T24",{"$f":"IF(G223=11.5,\"X\",\"\")","v":{"$error":"#REF!"}}]
["LEED v4 BD+C: Homes","EA","P","Home Size","EA111","x",{"$f":"EA!#REF!","v":{"$error":"#REF!"}},38,"12 points","EA11T25",{"$f":"IF(G224=12,\"X\",\"\")","v":{"$error":"#REF!"}}]
["LEED v4 BD+C: Homes","EA","P","Home Size","EA111","x",{"$f":"EA!#REF!","v":{"$error":"#REF!"}},38,"12.5 points","EA11T26",{"$f":"IF(G225=12.5,\"X\",\"\")","v":{"$error":"#REF!"}}]
["LEED v4 BD+C: Homes","EA","P","Home Size","EA111","x",{"$f":"EA!#REF!","v":{"$error":"#REF!"}},38,"13 points","EA11T27",{"$f":"IF(G226=13,\"X\",\"\")","v":{"$error":"#REF!"}}]
["LEED v4 BD+C: Homes","EA","P","Home Size","EA111","x",{"$f":"EA!#REF!","v":{"$error":"#REF!"}},38,"13.5 points","EA11T28",{"$f":"IF(G227=13.5,\"X\",\"\")","v":{"$error":"#REF!"}}]
["LEED v4 BD+C: Homes","EA","P","Home Size","EA111","x",{"$f":"EA!#REF!","v":{"$error":"#REF!"}},38,"14 points","EA11T29",{"$f":"IF(G228=14,\"X\",\"\")","v":{"$error":"#REF!"}}]
["LEED v4 BD+C: Homes","EA","P","Home Size","EA111","x",{"$f":"EA!#REF!","v":{"$error":"#REF!"}},38,"14.5 points","EA11T30",{"$f":"IF(G229=14.5,\"X\",\"\")","v":{"$error":"#REF!"}}]
["LEED v4 BD+C: Homes","EA","P","Home Size","EA111","x",{"$f":"EA!#REF!","v":{"$error":"#REF!"}},38,"15 points","EA11T31",{"$f":"IF(G230=15,\"X\",\"\")","v":{"$error":"#REF!"}}]
["LEED v4 BD+C: Homes","EA","P","Home Size","EA111","x",{"$f":"EA!#REF!","v":{"$error":"#REF!"}},38,"15.5 points","EA11T32",{"$f":"IF(G231=15.5,\"X\",\"\")","v":{"$error":"#REF!"}}]
["LEED v4 BD+C: Homes","EA","P","Home Size","EA111","x",{"$f":"EA!#REF!","v":{"$error":"#REF!"}},38,"16 points","EA11T33",{"$f":"IF(G232=16,\"X\",\"\")","v":{"$error":"#REF!"}}]
["LEED v4 BD+C: Homes","EA","P","Home Size","EA111","x",{"$f":"EA!#REF!","v":{"$error":"#REF!"}},38,"16.5 points","EA11T34",{"$f":"IF(G233=16.5,\"X\",\"\")","v":{"$error":"#REF!"}}]
["LEED v4 BD+C: Homes","EA","P","Home Size","EA111","x",{"$f":"EA!#REF!","v":{"$error":"#REF!"}},38,"17 points","EA11T35",{"$f":"IF(G234=17,\"X\",\"\")","v":{"$error":"#REF!"}}]
["LEED v4 BD+C: Homes","EA","P","Home Size","EA111","x",{"$f":"EA!#REF!","v":{"$error":"#REF!"}},38,"17.5 points","EA11T36",{"$f":"IF(G235=17.5,\"X\",\"\")","v":{"$error":"#REF!"}}]
["LEED v4 BD+C: Homes","EA","P","Home Size","EA111","x",{"$f":"EA!#REF!","v":{"$error":"#REF!"}},38,"18 points","EA11T37",{"$f":"IF(G236=18,\"X\",\"\")","v":{"$error":"#REF!"}}]
["LEED v4 BD+C: Homes","EA","P","Home Size","EA111","x",{"$f":"EA!#REF!","v":{"$error":"#REF!"}},38,"18.5 points","EA11T38",{"$f":"IF(G237=18.5,\"X\",\"\")","v":{"$error":"#REF!"}}]
["LEED v4 BD+C: Homes","EA","P","Home Size","EA111","x",{"$f":"EA!#REF!","v":{"$error":"#REF!"}},38,"19 points","EA11T39",{"$f":"IF(G238=19,\"X\",\"\")","v":{"$error":"#REF!"}}]
["LEED v4 BD+C: Homes","EA","P","Home Size","EA111","x",{"$f":"EA!#REF!","v":{"$error":"#REF!"}},38,"19.5 points","EA11T40",{"$f":"IF(G239=19.5,\"X\",\"\")","v":{"$error":"#REF!"}}]
["LEED v4 BD+C: Homes","EA","P","Home Size","EA111","x",{"$f":"EA!#REF!","v":{"$error":"#REF!"}},38,"20 points","EA11T41",{"$f":"IF(G240=20,\"X\",\"\")","v":{"$error":"#REF!"}}]
["LEED v4 BD+C: Homes","EA","P","Home Size","EA111","x",{"$f":"EA!#REF!","v":{"$error":"#REF!"}},38,"20.5 points","EA11T42",{"$f":"IF(G241=20.5,\"X\",\"\")","v":{"$error":"#REF!"}}]
["LEED v4 BD+C: Homes","EA","P","Home Size","EA111","x",{"$f":"EA!#REF!","v":{"$error":"#REF!"}},38,"21 points","EA11T43",{"$f":"IF(G242=21,\"X\",\"\")","v":{"$error":"#REF!"}}]
["LEED v4 BD+C: Homes","EA","P","Home Size","EA111","x",{"$f":"EA!#REF!","v":{"$error":"#REF!"}},38,"21.5 points","EA11T44",{"$f":"IF(G243=21.5,\"X\",\"\")","v":{"$error":"#REF!"}}]
["LEED v4 BD+C: Homes","EA","P","Home Size","EA111","x",{"$f":"EA!#REF!","v":{"$error":"#REF!"}},38,"22 points","EA11T45",{"$f":"IF(G244=22,\"X\",\"\")","v":{"$error":"#REF!"}}]
["LEED v4 BD+C: Homes","EA","P","Home Size","EA111","x",{"$f":"EA!#REF!","v":{"$error":"#REF!"}},38,"22.5 points","EA11T46",{"$f":"IF(G245=22.5,\"X\",\"\")","v":{"$error":"#REF!"}}]
["LEED v4 BD+C: Homes","EA","P","Home Size","EA111","x",{"$f":"EA!#REF!","v":{"$error":"#REF!"}},38,"23 points","EA11T47",{"$f":"IF(G246=23,\"X\",\"\")","v":{"$error":"#REF!"}}]
["LEED v4 BD+C: Homes","EA","P","Home Size","EA111","x",{"$f":"EA!#REF!","v":{"$error":"#REF!"}},38,"23.5 points","EA11T48",{"$f":"IF(G247=23.5,\"X\",\"\")","v":{"$error":"#REF!"}}]
["LEED v4 BD+C: Homes","EA","P","Home Size","EA111","x",{"$f":"EA!#REF!","v":{"$error":"#REF!"}},38,"24 points","EA11T49",{"$f":"IF(G248=24,\"X\",\"\")","v":{"$error":"#REF!"}}]
["LEED v4 BD+C: Homes","EA","P","Home Size","EA111","x",{"$f":"EA!#REF!","v":{"$error":"#REF!"}},38,"24.5 points","EA11T50",{"$f":"IF(G249=24.5,\"X\",\"\")","v":{"$error":"#REF!"}}]
["LEED v4 BD+C: Homes","EA","P","Home Size","EA111","x",{"$f":"EA!#REF!","v":{"$error":"#REF!"}},38,"25 points","EA11T51",{"$f":"IF(G250=25,\"X\",\"\")","v":{"$error":"#REF!"}}]
["LEED v4 BD+C: Homes","EA","P","Home Size","EA111","x",{"$f":"EA!#REF!","v":{"$error":"#REF!"}},38,"25.5 points","EA11T52",{"$f":"IF(G251=25.5,\"X\",\"\")","v":{"$error":"#REF!"}}]
["LEED v4 BD+C: Homes","EA","P","Home Size","EA111","x",{"$f":"EA!#REF!","v":{"$error":"#REF!"}},38,"26 points","EA11T53",{"$f":"IF(G252=26,\"X\",\"\")","v":{"$error":"#REF!"}}]
["LEED v4 BD+C: Homes","EA","P","Home Size","EA111","x",{"$f":"EA!#REF!","v":{"$error":"#REF!"}},38,"26.5 points","EA11T54",{"$f":"IF(G253=26.5,\"X\",\"\")","v":{"$error":"#REF!"}}]
["LEED v4 BD+C: Homes","EA","P","Home Size","EA111","x",{"$f":"EA!#REF!","v":{"$error":"#REF!"}},38,"27 points","EA11T55",{"$f":"IF(G254=27,\"X\",\"\")","v":{"$error":"#REF!"}}]
["LEED v4 BD+C: Homes","EA","P","Home Size","EA111","x",{"$f":"EA!#REF!","v":{"$error":"#REF!"}},38,"27.5 points","EA11T56",{"$f":"IF(G255=27.8,\"X\",\"\")","v":{"$error":"#REF!"}}]
["LEED v4 BD+C: Homes","EA","P","Home Size","EA111","x",{"$f":"EA!#REF!","v":{"$error":"#REF!"}},38,"28 points","EA11T57",{"$f":"IF(G256=28,\"X\",\"\")","v":{"$error":"#REF!"}}]
["LEED v4 BD+C: Homes","EA","P","Home Size","EA111","x",{"$f":"EA!#REF!","v":{"$error":"#REF!"}},38,"28.5 points","EA11T58",{"$f":"IF(G257=28.5,\"X\",\"\")","v":{"$error":"#REF!"}}]
["LEED v4 BD+C: Homes","EA","P","Home Size","EA111","x",{"$f":"EA!#REF!","v":{"$error":"#REF!"}},38,"29 points","EA11T59",{"$f":"IF(G258=29,\"X\",\"\")","v":{"$error":"#REF!"}}]
["LEED v4 BD+C: Homes","EA","P","Home Size","EA111","x",{"$f":"EA!#REF!","v":{"$error":"#REF!"}},38,"29.5 points","EA11T60",{"$f":"IF(G259=29.5,\"X\",\"\")","v":{"$error":"#REF!"}}]
["LEED v4 BD+C: Homes","EA","P","Home Size","EA111","x",{"$f":"EA!#REF!","v":{"$error":"#REF!"}},38,"30 points","EA11T61",{"$f":"IF(G260=30,\"X\",\"\")","v":{"$error":"#REF!"}}]
["LEED v4 BD+C: Homes","EA","P","Home Size","EA111","x",{"$f":"EA!#REF!","v":{"$error":"#REF!"}},38,"30.5 points","EA11T62",{"$f":"IF(G261=30.5,\"X\",\"\")","v":{"$error":"#REF!"}}]
["LEED v4 BD+C: Homes","EA","P","Home Size","EA111","x",{"$f":"EA!#REF!","v":{"$error":"#REF!"}},38,"31 points ","EA11T63",{"$f":"IF(G262=31,\"X\",\"\")","v":{"$error":"#REF!"}}]
["LEED v4 BD+C: Homes","EA","P","Home Size","EA111","x",{"$f":"EA!#REF!","v":{"$error":"#REF!"}},38,"31.5 points","EA11T64",{"$f":"IF(G263=31.5,\"X\",\"\")","v":{"$error":"#REF!"}}]
["LEED v4 BD+C: Homes","EA","P","Home Size","EA111","x",{"$f":"EA!#REF!","v":{"$error":"#REF!"}},38,"32 points","EA11T65",{"$f":"IF(G264=32,\"X\",\"\")","v":{"$error":"#REF!"}}]
["LEED v4 BD+C: Homes","EA","P","Home Size","EA111","x",{"$f":"EA!#REF!","v":{"$error":"#REF!"}},38,"32.5 points","EA11T66",{"$f":"IF(G265=32.5,\"X\",\"\")","v":{"$error":"#REF!"}}]
["LEED v4 BD+C: Homes","EA","P","Home Size","EA111","x",{"$f":"EA!#REF!","v":{"$error":"#REF!"}},38,"33 points","EA11T67",{"$f":"IF(G266=33,\"X\",\"\")","v":{"$error":"#REF!"}}]
["LEED v4 BD+C: Homes","EA","P","Home Size","EA111","x",{"$f":"EA!#REF!","v":{"$error":"#REF!"}},38,"33.5 points","EA11T68",{"$f":"IF(G267=33.5,\"X\",\"\")","v":{"$error":"#REF!"}}]
["LEED v4 BD+C: Homes","EA","P","Home Size","EA111","x",{"$f":"EA!#REF!","v":{"$error":"#REF!"}},38,"34 points","EA11T69",{"$f":"IF(G268=34,\"X\",\"\")","v":{"$error":"#REF!"}}]
["LEED v4 BD+C: Homes","EA","P","Home Size","EA111","x",{"$f":"EA!#REF!","v":{"$error":"#REF!"}},38,"34.5 points","EA11T70",{"$f":"IF(G269=34.5,\"X\",\"\")","v":{"$error":"#REF!"}}]
["LEED v4 BD+C: Homes","EA","P","Home Size","EA111","x",{"$f":"EA!#REF!","v":{"$error":"#REF!"}},38,"35 points","EA11T71",{"$f":"IF(G270=35,\"X\",\"\")","v":{"$error":"#REF!"}}]
["LEED v4 BD+C: Homes","EA","P","Home Size","EA111","x",{"$f":"EA!#REF!","v":{"$error":"#REF!"}},38,"35.5 points","EA11T72",{"$f":"IF(G271=35.5,\"X\",\"\")","v":{"$error":"#REF!"}}]
["LEED v4 BD+C: Homes","EA","P","Home Size","EA111","x",{"$f":"EA!#REF!","v":{"$error":"#REF!"}},38,"36 points","EA11T73",{"$f":"IF(G272=36,\"X\",\"\")","v":{"$error":"#REF!"}}]
["LEED v4 BD+C: Homes","EA","P","Home Size","EA111","x",{"$f":"EA!#REF!","v":{"$error":"#REF!"}},38,"36.5 points","EA11T74",{"$f":"IF(G273=36.5,\"X\",\"\")","v":{"$error":"#REF!"}}]
["LEED v4 BD+C: Homes","EA","P","Home Size","EA111","x",{"$f":"EA!#REF!","v":{"$error":"#REF!"}},38,"37 points","EA11T75",{"$f":"IF(G274=37,\"X\",\"\")","v":{"$error":"#REF!"}}]
["LEED v4 BD+C: Homes","EA","P","Home Size","EA111","x",{"$f":"EA!#REF!","v":{"$error":"#REF!"}},38,"37.5 points","EA11T76",{"$f":"IF(G275=37.5,\"X\",\"\")","v":{"$error":"#REF!"}}]
["LEED v4 BD+C: Homes","EA","P","Home Size","EA111","x",{"$f":"EA!#REF!","v":{"$error":"#REF!"}},38,"38 points","EA11T77",{"$f":"IF(G42>0=38,\"X\",\"\")","v":""}]
["LEED v4 BD+C: Homes","EA","C","Building Orientation for Passive Solar","EA112",{"$f":"IF(EA!#REF!>0,\"X\",\"\")","v":{"$error":"#REF!"}},{"$f":"EA!#REF!","v":{"$error":"#REF!"}},3]
["LEED v4 BD+C: Homes","EA","C","Air Infiltration","EA113",{"$f":"IF(EA!#REF!>0,\"X\",\"\")","v":{"$error":"#REF!"}},{"$f":"EA!#REF!","v":{"$error":"#REF!"}},2,null,null,null,"Case 1","EA13O1",{"$f":"IF(EA!#REF!>0,\"X\",\"\")","v":{"$error":"#REF!"}}]
["LEED v4 BD+C: Homes","EA","C","Air Infiltration","EA113",{"$f":"IF(EA!#REF!>0,\"X\",\"\")","v":{"$error":"#REF!"}},{"$f":"EA!#REF!","v":{"$error":"#REF!"}},2,null,null,null,"Case 1","EA13O1",{"$f":"IF(EA!#REF!>0,\"X\",\"\")","v":{"$error":"#REF!"}},"1 point","EA13O1P1",{"$f":"IF(EA!#REF!=1,\"X\",\"\")","v":{"$error":"#REF!"}}]
["LEED v4 BD+C: Homes","EA","C","Air Infiltration","EA113",{"$f":"IF(EA!#REF!>0,\"X\",\"\")","v":{"$error":"#REF!"}},{"$f":"EA!#REF!","v":{"$error":"#REF!"}},2,null,null,null,"Case 1","EA13O1",{"$f":"IF(EA!#REF!>0,\"X\",\"\")","v":{"$error":"#REF!"}},"2 points","EA13O1P2",{"$f":"IF(EA!#REF!=2,\"X\",\"\")","v":{"$error":"#REF!"}}]
["LEED v4 BD+C: Homes","EA","C","Air Infiltration","EA113",{"$f":"IF(EA!#REF!>0,\"X\",\"\")","v":{"$error":"#REF!"}},{"$f":"EA!#REF!","v":{"$error":"#REF!"}},2,null,null,null,"Case 2","EA13O2",{"$f":"IF(EA!#REF!>0,\"X\",\"\")","v":{"$error":"#REF!"}}]
["LEED v4 BD+C: Homes","EA","C","Air Infiltration","EA113",{"$f":"IF(EA!#REF!>0,\"X\",\"\")","v":{"$error":"#REF!"}},{"$f":"EA!#REF!","v":{"$error":"#REF!"}},2,null,null,null,"Case 2","EA13O2",{"$f":"IF(EA!#REF!>0,\"X\",\"\")","v":{"$error":"#REF!"}},"1 point","EA13O2P1",{"$f":"IF(EA!#REF!=1,\"X\",\"\")","v":{"$error":"#REF!"}}]
["LEED v4 BD+C: Homes","EA","C","Air Infiltration","EA113",{"$f":"IF(EA!#REF!>0,\"X\",\"\")","v":{"$error":"#REF!"}},{"$f":"EA!#REF!","v":{"$error":"#REF!"}},2,null,null,null,"Case 2","EA13O2",{"$f":"IF(EA!#REF!>0,\"X\",\"\")","v":{"$error":"#REF!"}},"2 points","EA13O2P2",{"$f":"IF(EA!#REF!=2,\"X\",\"\")","v":{"$error":"#REF!"}}]
["LEED v4 BD+C: Homes","EA","C","Envelope Insulation","EA114",{"$f":"IF(EA!#REF!>0,\"X\",\"\")","v":{"$error":"#REF!"}},{"$f":"EA!#REF!","v":{"$error":"#REF!"}},2,"1 point","EA14T1",{"$f":"IF(G284=1,\"X\",\"\")","v":{"$error":"#REF!"}}]
["LEED v4 BD+C: Homes","EA","C","Envelope Insulation","EA114",{"$f":"IF(EA!#REF!>0,\"X\",\"\")","v":{"$error":"#REF!"}},{"$f":"EA!#REF!","v":{"$error":"#REF!"}},2,"2 points","EA14T2",{"$f":"IF(G285=2,\"X\",\"\")","v":{"$error":"#REF!"}}]
["LEED v4 BD+C: Homes","EA","C","Windows","EA115",{"$f":"IF(EA!#REF!>0,\"X\",\"\")","v":{"$error":"#REF!"}},{"$f":"EA!#REF!","v":{"$error":"#REF!"}},3,"1.5 points","EA15T1",{"$f":"IF(G286=1.5,\"X\",\"\")","v":{"$error":"#REF!"}}]
["LEED v4 BD+C: Homes","EA","C","Windows","EA115",{"$f":"IF(EA!#REF!>0,\"X\",\"\")","v":{"$error":"#REF!"}},{"$f":"EA!#REF!","v":{"$error":"#REF!"}},3,"3 points","EA15T2",{"$f":"IF(G287=3,\"X\",\"\")","v":{"$error":"#REF!"}}]
["LEED v4 BD+C: Homes","EA","C","Space Heating & Cooling Equipment","EA116",{"$f":"IF(EA!#REF!>0,\"X\",\"\")","v":{"$error":"#REF!"}},{"$f":"EA!#REF!","v":{"$error":"#REF!"}},4,"1 point","EA16T1",{"$f":"IF(G288=1,\"X\",\"\")","v":{"$error":"#REF!"}}]
["LEED v4 BD+C: Homes","EA","C","Space Heating & Cooling Equipment","EA116",{"$f":"IF(EA!#REF!>0,\"X\",\"\")","v":{"$error":"#REF!"}},{"$f":"EA!#REF!","v":{"$error":"#REF!"}},4,"2 points","EA16T2",{"$f":"IF(G289=2,\"X\",\"\")","v":{"$error":"#REF!"}}]
["LEED v4 BD+C: Homes","EA","C","Space Heating & Cooling Equipment","EA116",{"$f":"IF(EA!#REF!>0,\"X\",\"\")","v":{"$error":"#REF!"}},{"$f":"EA!#REF!","v":{"$error":"#REF!"}},4,"3 points","EA16T3",{"$f":"IF(G290=3,\"X\",\"\")","v":{"$error":"#REF!"}}]
["LEED v4 BD+C: Homes","EA","C","Space Heating & Cooling Equipment","EA116",{"$f":"IF(EA!#REF!>0,\"X\",\"\")","v":{"$error":"#REF!"}},{"$f":"EA!#REF!","v":{"$error":"#REF!"}},4,"4 points","EA16T4",{"$f":"IF(G291=4,\"X\",\"\")","v":{"$error":"#REF!"}}]
["LEED v4 BD+C: Homes","EA","C","Heating & Cooling Distribution Systems","EA117",{"$f":"IF(EA!#REF!>0,\"X\",\"\")","v":{"$error":"#REF!"}},{"$f":"EA!#REF!","v":{"$error":"#REF!"}},3,null,null,null,"Case 1","EA17O1",{"$f":"IF(EA!#REF!>0,\"X\",\"\")","v":{"$error":"#REF!"}}]
["LEED v4 BD+C: Homes","EA","C","Heating & Cooling Distribution Systems","EA117",{"$f":"IF(EA!#REF!>0,\"X\",\"\")","v":{"$error":"#REF!"}},{"$f":"EA!#REF!","v":{"$error":"#REF!"}},3,null,null,null,"Case 1","EA17O1",{"$f":"IF(EA!#REF!>0,\"X\",\"\")","v":{"$error":"#REF!"}},"Option 1","EA17O1P1",{"$f":"IF(EA!#REF!>0,\"X\",\"\")","v":{"$error":"#REF!"}}]
["LEED v4 BD+C: Homes","EA","C","Heating & Cooling Distribution Systems","EA117",{"$f":"IF(EA!#REF!>0,\"X\",\"\")","v":{"$error":"#REF!"}},{"$f":"EA!#REF!","v":{"$error":"#REF!"}},3,null,null,null,"Case 1","EA17O1",{"$f":"IF(EA!#REF!>0,\"X\",\"\")","v":{"$error":"#REF!"}},"Option 2","EA17O1P2",{"$f":"IF(EA!#REF!>0,\"X\",\"\")","v":{"$error":"#REF!"}}]
["LEED v4 BD+C: Homes","EA","C","Heating & Cooling Distribution Systems","EA117",{"$f":"IF(EA!#REF!>0,\"X\",\"\")","v":{"$error":"#REF!"}},{"$f":"EA!#REF!","v":{"$error":"#REF!"}},3,null,null,null,"Case 2","EA17O2",{"$f":"IF(EA!#REF!>0,\"X\",\"\")","v":{"$error":"#REF!"}}]
["LEED v4 BD+C: Homes","EA","C","Heating & Cooling Distribution Systems","EA117",{"$f":"IF(EA!#REF!>0,\"X\",\"\")","v":{"$error":"#REF!"}},{"$f":"EA!#REF!","v":{"$error":"#REF!"}},3,null,null,null,"Case 2","EA17O2",{"$f":"IF(EA!#REF!>0,\"X\",\"\")","v":{"$error":"#REF!"}},"2 points","EA17O2P1",{"$f":"IF(EA!#REF!=2,\"X\",\"\")","v":{"$error":"#REF!"}}]
["LEED v4 BD+C: Homes","EA","C","Heating & Cooling Distribution Systems","EA117",{"$f":"IF(EA!#REF!>0,\"X\",\"\")","v":{"$error":"#REF!"}},{"$f":"EA!#REF!","v":{"$error":"#REF!"}},3,null,null,null,"Case 2","EA17O2",{"$f":"IF(EA!#REF!>0,\"X\",\"\")","v":{"$error":"#REF!"}},"3 points","EA17O2P2",{"$f":"IF(EA!#REF!=3,\"X\",\"\")","v":{"$error":"#REF!"}}]
["LEED v4 BD+C: Homes","EA","C","Efficient Domestic Hot Water Equipment","EA118",{"$f":"IF(EA!#REF!>0,\"X\",\"\")","v":{"$error":"#REF!"}},{"$f":"EA!#REF!","v":{"$error":"#REF!"}},3,"1 point","EA18T1",{"$f":"IF(G298=1,\"X\",\"\")","v":{"$error":"#REF!"}}]
["LEED v4 BD+C: Homes","EA","C","Efficient Domestic Hot Water Equipment","EA118",{"$f":"IF(EA!#REF!>0,\"X\",\"\")","v":{"$error":"#REF!"}},{"$f":"EA!#REF!","v":{"$error":"#REF!"}},3,"1.5 points","EA18T2",{"$f":"IF(G299=1.5,\"X\",\"\")","v":{"$error":"#REF!"}}]
["LEED v4 BD+C: Homes","EA","C","Efficient Domestic Hot Water Equipment","EA118",{"$f":"IF(EA!#REF!>0,\"X\",\"\")","v":{"$error":"#REF!"}},{"$f":"EA!#REF!","v":{"$error":"#REF!"}},3,"2 points","EA18T3",{"$f":"IF(G300=2,\"X\",\"\")","v":{"$error":"#REF!"}}]
["LEED v4 BD+C: Homes","EA","C","Efficient Domestic Hot Water Equipment","EA118",{"$f":"IF(EA!#REF!>0,\"X\",\"\")","v":{"$error":"#REF!"}},{"$f":"EA!#REF!","v":{"$error":"#REF!"}},3,"2.5 points","EA18T4",{"$f":"IF(G301=2.5,\"X\",\"\")","v":{"$error":"#REF!"}}]
["LEED v4 BD+C: Homes","EA","C","Efficient Domestic Hot Water Equipment","EA118",{"$f":"IF(EA!#REF!>0,\"X\",\"\")","v":{"$error":"#REF!"}},{"$f":"EA!#REF!","v":{"$error":"#REF!"}},3,"3 points","EA18T5",{"$f":"IF(G302=3,\"X\",\"\")","v":{"$error":"#REF!"}}]
["LEED v4 BD+C: Homes","EA","C","Lighting","EA119",{"$f":"IF(EA!#REF!>0,\"X\",\"\")","v":{"$error":"#REF!"}},{"$f":"EA!#REF!","v":{"$error":"#REF!"}},2,null,null,null,"Case 1, Option 1","EA19O1",{"$f":"IF(EA!#REF!>0,\"X\",\"\")","v":{"$error":"#REF!"}}]
["LEED v4 BD+C: Homes","EA","C","Lighting","EA119",{"$f":"IF(EA!#REF!>0,\"X\",\"\")","v":{"$error":"#REF!"}},{"$f":"EA!#REF!","v":{"$error":"#REF!"}},2,null,null,null,"Case 1, Option 1","EA19O1",{"$f":"IF(EA!#REF!>0,\"X\",\"\")","v":{"$error":"#REF!"}},"0.5 points","EA19O1P1",{"$f":"IF(EA!#REF!=0.5,\"X\",\"\")","v":{"$error":"#REF!"}}]
["LEED v4 BD+C: Homes","EA","C","Lighting","EA119",{"$f":"IF(EA!#REF!>0,\"X\",\"\")","v":{"$error":"#REF!"}},{"$f":"EA!#REF!","v":{"$error":"#REF!"}},2,null,null,null,"Case 1, Option 1","EA19O1",{"$f":"IF(EA!#REF!>0,\"X\",\"\")","v":{"$error":"#REF!"}},"1 point ","EA19O1P2",{"$f":"IF(EA!#REF!=1,\"X\",\"\")","v":{"$error":"#REF!"}}]
["LEED v4 BD+C: Homes","EA","C","Lighting","EA119",{"$f":"IF(EA!#REF!>0,\"X\",\"\")","v":{"$error":"#REF!"}},{"$f":"EA!#REF!","v":{"$error":"#REF!"}},2,null,null,null,"Case 1, Option 1","EA19O1",{"$f":"IF(EA!#REF!>0,\"X\",\"\")","v":{"$error":"#REF!"}},"1.5 points","EA19O1P3",{"$f":"IF(EA!#REF!=1.5,\"X\",\"\")","v":{"$error":"#REF!"}}]
["LEED v4 BD+C: Homes","EA","C","Lighting","EA119",{"$f":"IF(EA!#REF!>0,\"X\",\"\")","v":{"$error":"#REF!"}},{"$f":"EA!#REF!","v":{"$error":"#REF!"}},2,null,null,null,"Case 1, Option 2","EA19O2",{"$f":"IF(EA!#REF!>0,\"X\",\"\")","v":{"$error":"#REF!"}}]
["LEED v4 BD+C: Homes","EA","C","Lighting","EA119",{"$f":"IF(EA!#REF!>0,\"X\",\"\")","v":{"$error":"#REF!"}},{"$f":"EA!#REF!","v":{"$error":"#REF!"}},2,null,null,null,"Case 2, Option 1","EA19O3",{"$f":"IF(EA!#REF!>0,\"X\",\"\")","v":{"$error":"#REF!"}}]
["LEED v4 BD+C: Homes","EA","C","Lighting","EA119",{"$f":"IF(EA!#REF!>0,\"X\",\"\")","v":{"$error":"#REF!"}},{"$f":"EA!#REF!","v":{"$error":"#REF!"}},2,null,null,null,"Case 2, Option 1","EA19O3",{"$f":"IF(EA!#REF!>0,\"X\",\"\")","v":{"$error":"#REF!"}},"0.5 points","EA19O3P1",{"$f":"IF(EA!#REF!=0.5,\"X\",\"\")","v":{"$error":"#REF!"}}]
["LEED v4 BD+C: Homes","EA","C","Lighting","EA119",{"$f":"IF(EA!#REF!>0,\"X\",\"\")","v":{"$error":"#REF!"}},{"$f":"EA!#REF!","v":{"$error":"#REF!"}},2,null,null,null,"Case 2, Option 1","EA19O3",{"$f":"IF(EA!#REF!>0,\"X\",\"\")","v":{"$error":"#REF!"}},"1 point ","EA19O3P2",{"$f":"IF(EA!#REF!=1,\"X\",\"\")","v":{"$error":"#REF!"}}]
["LEED v4 BD+C: Homes","EA","C","Lighting","EA119",{"$f":"IF(EA!#REF!>0,\"X\",\"\")","v":{"$error":"#REF!"}},{"$f":"EA!#REF!","v":{"$error":"#REF!"}},2,null,null,null,"Case 2, Option 1","EA19O3",{"$f":"IF(EA!#REF!>0,\"X\",\"\")","v":{"$error":"#REF!"}},"1.5 points","EA19O3P3",{"$f":"IF(EA!#REF!=1.5,\"X\",\"\")","v":{"$error":"#REF!"}}]
["LEED v4 BD+C: Homes","EA","C","Lighting","EA119",{"$f":"IF(EA!#REF!>0,\"X\",\"\")","v":{"$error":"#REF!"}},{"$f":"EA!#REF!","v":{"$error":"#REF!"}},2,null,null,null,"Case 2, Option 2","EA19O4",{"$f":"IF(EA!#REF!>0,\"X\",\"\")","v":{"$error":"#REF!"}}]
["LEED v4 BD+C: Homes","EA","C","High-Efficiency Appliances","EA120",{"$f":"IF(EA!#REF!>0,\"X\",\"\")","v":{"$error":"#REF!"}},{"$f":"EA!#REF!","v":{"$error":"#REF!"}},2,"0.5 points","EA20T1",{"$f":"IF(G313=0.5,\"X\",\"\")","v":{"$error":"#REF!"}}]
["LEED v4 BD+C: Homes","EA","C","High-Efficiency Appliances","EA120",{"$f":"IF(EA!#REF!>0,\"X\",\"\")","v":{"$error":"#REF!"}},{"$f":"EA!#REF!","v":{"$error":"#REF!"}},2,"1 point","EA20T2",{"$f":"IF(G314=1,\"X\",\"\")","v":{"$error":"#REF!"}}]
["LEED v4 BD+C: Homes","EA","C","High-Efficiency Appliances","EA120",{"$f":"IF(EA!#REF!>0,\"X\",\"\")","v":{"$error":"#REF!"}},{"$f":"EA!#REF!","v":{"$error":"#REF!"}},2,"1.5 points","EA20T3",{"$f":"IF(G315=1.5,\"X\",\"\")","v":{"$error":"#REF!"}}]
["LEED v4 BD+C: Homes","EA","C","High-Efficiency Appliances","EA120",{"$f":"IF(EA!#REF!>0,\"X\",\"\")","v":{"$error":"#REF!"}},{"$f":"EA!#REF!","v":{"$error":"#REF!"}},2,"2 points","EA20T4",{"$f":"IF(G316=2,\"X\",\"\")","v":{"$error":"#REF!"}}]
["LEED v4 BD+C: Homes","EA","C","Renewable Energy","EA121",{"$f":"IF(EA!#REF!>0,\"X\",\"\")","v":{"$error":"#REF!"}},{"$f":"EA!#REF!","v":{"$error":"#REF!"}},4,"1 point","EA21T1",{"$f":"IF(G317=1,\"X\",\"\")","v":{"$error":"#REF!"}}]
["LEED v4 BD+C: Homes","EA","C","Renewable Energy","EA121",{"$f":"IF(EA!#REF!>0,\"X\",\"\")","v":{"$error":"#REF!"}},{"$f":"EA!#REF!","v":{"$error":"#REF!"}},4,"2 points","EA21T2",{"$f":"IF(G318=2,\"X\",\"\")","v":{"$error":"#REF!"}}]
["LEED v4 BD+C: Homes","EA","C","Renewable Energy","EA121",{"$f":"IF(EA!#REF!>0,\"X\",\"\")","v":{"$error":"#REF!"}},{"$f":"EA!#REF!","v":{"$error":"#REF!"}},4,"3 points","EA21T3",{"$f":"IF(G319=3,\"X\",\"\")","v":{"$error":"#REF!"}}]
["LEED v4 BD+C: Homes","EA","C","Renewable Energy","EA121",{"$f":"IF(EA!#REF!>0,\"X\",\"\")","v":{"$error":"#REF!"}},{"$f":"EA!#REF!","v":{"$error":"#REF!"}},4,"4 points","EA21T4",{"$f":"IF(G320=4,\"X\",\"\")","v":{"$error":"#REF!"}}]
["LEED v4 BD+C: Homes","MR","P","Certified tropical wood","MR101","x",{"$f":"MR!$J$7","v":"N"},0]
["LEED v4 BD+C: Homes","MR","P","Durability management","MR102","x",{"$f":"MR!$J$14","v":"N"},0]
["LEED v4 BD+C: Homes","MR","C","Durability management verification","MR103",{"$f":"IF(MR!$J$39>0,\"X\",\"\")","v":""},{"$f":"MR!$J$39","v":0},1]
["LEED v4 BD+C: Homes","MR","C","Environmentally preferable products","MR104",{"$f":"IF(MR!$J$66>0,\"X\",\"\")","v":""},{"$f":"MR!$J$66","v":0},4,null,null,null,"Option 1","MR04O1",{"$f":"IF(MR!$J$70>0,\"X\",\"\")","v":""}]
["LEED v4 BD+C: Homes","MR","C","Environmentally preferable products","MR104",{"$f":"IF(MR!$J$66>0,\"X\",\"\")","v":""},{"$f":"MR!$J$66","v":0},4,null,null,null,"Option 1","MR04O1",{"$f":"IF(MR!$J$70>0,\"X\",\"\")","v":""},"0.5 points","MR04O1P1",{"$f":"IF(MR!$J$70=0.5,\"X\",\"\")","v":""}]
["LEED v4 BD+C: Homes","MR","C","Environmentally preferable products","MR104",{"$f":"IF(MR!$J$66>0,\"X\",\"\")","v":""},{"$f":"MR!$J$66","v":0},4,null,null,null,"Option 1","MR04O1",{"$f":"IF(MR!$J$70>0,\"X\",\"\")","v":""},"1 point","MR04O1P2",{"$f":"IF(MR!$J$70=1,\"X\",\"\")","v":""}]
["LEED v4 BD+C: Homes","MR","C","Environmentally preferable products","MR104",{"$f":"IF(MR!$J$66>0,\"X\",\"\")","v":""},{"$f":"MR!$J$66","v":0},4,null,null,null,"Option 1","MR04O1",{"$f":"IF(MR!$J$70>0,\"X\",\"\")","v":""},"1.5 points","MR04O1P3",{"$f":"IF(MR!$J$70=1.5,\"X\",\"\")","v":""}]
["LEED v4 BD+C: Homes","MR","C","Environmentally preferable products","MR104",{"$f":"IF(MR!$J$66>0,\"X\",\"\")","v":""},{"$f":"MR!$J$66","v":0},4,null,null,null,"Option 2","MR04O2",{"$f":"IF(MR!$J$79>0,\"X\",\"\")","v":""}]
["LEED v4 BD+C: Homes","MR","C","Environmentally preferable products","MR104",{"$f":"IF(MR!$J$66>0,\"X\",\"\")","v":""},{"$f":"MR!$J$66","v":0},4,null,null,null,"Option 2","MR04O2",{"$f":"IF(MR!$J$79>0,\"X\",\"\")","v":""},"0.5 points","MR04O2P1",{"$f":"IF(MR!$J$79=0.5,\"X\",\"\")","v":""}]
["LEED v4 BD+C: Homes","MR","C","Environmentally preferable products","MR104",{"$f":"IF(MR!$J$66>0,\"X\",\"\")","v":""},{"$f":"MR!$J$66","v":0},4,null,null,null,"Option 2","MR04O2",{"$f":"IF(MR!$J$79>0,\"X\",\"\")","v":""},"1 point","MR04O2P2",{"$f":"IF(MR!$J$79=1,\"X\",\"\")","v":""}]
["LEED v4 BD+C: Homes","MR","C","Environmentally preferable products","MR104",{"$f":"IF(MR!$J$66>0,\"X\",\"\")","v":""},{"$f":"MR!$J$66","v":0},4,null,null,null,"Option 2","MR04O2",{"$f":"IF(MR!$J$79>0,\"X\",\"\")","v":""},"1.5 points","MR04O2P3",{"$f":"IF(MR!$J$79=1.5,\"X\",\"\")","v":""}]
["LEED v4 BD+C: Homes","MR","C","Environmentally preferable products","MR104",{"$f":"IF(MR!$J$66>0,\"X\",\"\")","v":""},{"$f":"MR!$J$66","v":0},4,null,null,null,"Option 2","MR04O2",{"$f":"IF(MR!$J$79>0,\"X\",\"\")","v":""},"2 points","MR04O2P4",{"$f":"IF(MR!$J$79=2,\"X\",\"\")","v":""}]
["LEED v4 BD+C: Homes","MR","C","Environmentally preferable products","MR104",{"$f":"IF(MR!$J$66>0,\"X\",\"\")","v":""},{"$f":"MR!$J$66","v":0},4,null,null,null,"Option 2","MR04O2",{"$f":"IF(MR!$J$79>0,\"X\",\"\")","v":""},"2.5 points","MR04O2P5",{"$f":"IF(MR!$J$79=2.5,\"X\",\"\")","v":""}]
["LEED v4 BD+C: Homes","MR","C","Environmentally preferable products","MR104",{"$f":"IF(MR!$J$66>0,\"X\",\"\")","v":""},{"$f":"MR!$J$66","v":0},4,null,null,null,"Option 2","MR04O2",{"$f":"IF(MR!$J$79>0,\"X\",\"\")","v":""},"3 points","MR04O2P6",{"$f":"IF(MR!$J$79=3,\"X\",\"\")","v":""}]
["LEED v4 BD+C: Homes","MR","C","Environmentally preferable products","MR104",{"$f":"IF(MR!$J$66>0,\"X\",\"\")","v":""},{"$f":"MR!$J$66","v":0},4,null,null,null,"Option 2","MR04O2",{"$f":"IF(MR!$J$79>0,\"X\",\"\")","v":""},"3.5 points","MR04O2P7",{"$f":"IF(MR!$J$79=3.5,\"X\",\"\")","v":""}]
["LEED v4 BD+C: Homes","MR","C","Environmentally preferable products","MR104",{"$f":"IF(MR!$J$66>0,\"X\",\"\")","v":""},{"$f":"MR!$J$66","v":0},4,null,null,null,"Option 2","MR04O2",{"$f":"IF(MR!$J$79>0,\"X\",\"\")","v":""},"4 points","MR04O2P8",{"$f":"IF(MR!$J$79=4,\"X\",\"\")","v":""}]
["LEED v4 BD+C: Homes","MR","C","Construction waste management","MR105",{"$f":"IF(MR!$J$118>0,\"X\",\"\")","v":""},{"$f":"MR!$J$118","v":0},3,"0.5 points","MR05T1",{"$f":"IF(G337=0.5,\"X\",\"\")","v":""}]
["LEED v4 BD+C: Homes","MR","C","Construction waste management","MR105",{"$f":"IF(MR!$J$118>0,\"X\",\"\")","v":""},{"$f":"MR!$J$118","v":0},3,"1 point","MR05T2",{"$f":"IF(G338=1,\"X\",\"\")","v":""}]
["LEED v4 BD+C: Homes","MR","C","Construction waste management","MR105",{"$f":"IF(MR!$J$118>0,\"X\",\"\")","v":""},{"$f":"MR!$J$118","v":0},3,"1.5 points","MR05T3",{"$f":"IF(G339=1.5,\"X\",\"\")","v":""}]
["LEED v4 BD+C: Homes","MR","C","Construction waste management","MR105",{"$f":"IF(MR!$J$118>0,\"X\",\"\")","v":""},{"$f":"MR!$J$118","v":0},3,"2 points","MR05T4",{"$f":"IF(G340=2,\"X\",\"\")","v":""}]
["LEED v4 BD+C: Homes","MR","C","Construction waste management","MR105",{"$f":"IF(MR!$J$118>0,\"X\",\"\")","v":""},{"$f":"MR!$J$118","v":0},3,"2.5 points","MR05T5",{"$f":"IF(G341=2.5,\"X\",\"\")","v":""}]
["LEED v4 BD+C: Homes","MR","C","Construction waste management","MR105",{"$f":"IF(MR!$J$118>0,\"X\",\"\")","v":""},{"$f":"MR!$J$118","v":0},3,"3 points","MR05T6",{"$f":"IF(G342=3,\"X\",\"\")","v":""}]
["LEED v4 BD+C: Homes","MR","C","Material-efficient framing","MR106",{"$f":"IF(MR!$J$151>0,\"X\",\"\")","v":""},{"$f":"MR!$J$151","v":0},2,"0.5 points","MR06T1",{"$f":"IF(G343=0.5,\"X\",\"\")","v":""}]
["LEED v4 BD+C: Homes","MR","C","Material-efficient framing","MR106",{"$f":"IF(MR!$J$151>0,\"X\",\"\")","v":""},{"$f":"MR!$J$151","v":0},2,"1 point","MR06T2",{"$f":"IF(G344=1,\"X\",\"\")","v":""}]
["LEED v4 BD+C: Homes","MR","C","Material-efficient framing","MR106",{"$f":"IF(MR!$J$151>0,\"X\",\"\")","v":""},{"$f":"MR!$J$151","v":0},2,"1.5 points","MR06T3",{"$f":"IF(G345=1.5,\"X\",\"\")","v":""}]
["LEED v4 BD+C: Homes","MR","C","Material-efficient framing","MR106",{"$f":"IF(MR!$J$151>0,\"X\",\"\")","v":""},{"$f":"MR!$J$151","v":0},2,"2 points","MR06T4",{"$f":"IF(G346=2,\"X\",\"\")","v":""}]
["LEED v4 BD+C: Homes","EQ","P","Ventilation","EQ101","x",{"$f":"EQ!$J$7","v":"N"},0,null,null,null,"Case 1","EQ01O1",{"$f":"IF(EQ!$J$10=\"Y\",\"X\",\"\")","v":""}]
["LEED v4 BD+C: Homes","EQ","P","Ventilation","EQ101","x",{"$f":"EQ!$J$7","v":"N"},0,null,null,null,"Case 2","EQ01O2",{"$f":"IF(EQ!#REF!=\"Y\",\"X\",\"\")","v":{"$error":"#REF!"}}]
["LEED v4 BD+C: Homes","EQ","P","Combustion venting","EQ102","x",{"$f":"EQ!$J$32","v":"N"},0]
["LEED v4 BD+C: Homes","EQ","P","Garage pollutant protection","EQ103","x",{"$f":"EQ!$J$53","v":"N"},0]
["LEED v4 BD+C: Homes","EQ","P","Radon-resistant construction","EQ104","x",{"$f":"EQ!$J$73","v":"N"},0,null,null,null,"EPA label","EQ04O1",{"$f":"IF(EQ!$J$77=\"Y\",\"X\",\"\")","v":""}]
["LEED v4 BD+C: Homes","EQ","P","Radon-resistant construction","EQ104","x",{"$f":"EQ!$J$73","v":"N"},0,null,null,null,"Case 1","EQ04O2",{"$f":"IF(EQ!$J$83=\"Y\",\"X\",\"\")","v":""}]
["LEED v4 BD+C: Homes","EQ","P","Radon-resistant construction","EQ104","x",{"$f":"EQ!$J$73","v":"N"},0,null,null,null,"Case 2","EQ04O3",{"$f":"IF(EQ!$J$97=\"Y\",\"X\",\"\")","v":""}]
["LEED v4 BD+C: Homes","EQ","P","Air filtering","EQ105","x",{"$f":"EQ!$J$109","v":"N"},0]
["LEED v4 BD+C: Homes","EQ","P","Environmental tobacco smoke","EQ106","x",{"$f":"EQ!#REF!","v":{"$error":"#REF!"}},0]
["LEED v4 BD+C: Homes","EQ","P","Compartmentalization","EQ107","x",{"$f":"EQ!$J$119","v":"N"},0]
["LEED v4 BD+C: Homes","EQ","C","Enhanced ventilation","EQ108",{"$f":"IF(EQ!$J$135>0,\"X\",\"\")","v":""},{"$f":"EQ!$J$135","v":0},3,null,null,null,"Option 1","EQ08O1",{"$f":"IF(EQ!$J$139>0,\"X\",\"\")","v":""}]
["LEED v4 BD+C: Homes","EQ","C","Enhanced ventilation","EQ108",{"$f":"IF(EQ!$J$135>0,\"X\",\"\")","v":""},{"$f":"EQ!$J$135","v":0},3,null,null,null,"Option 2","EQ08O2",{"$f":"IF(EQ!$J$145>0,\"X\",\"\")","v":""}]
["LEED v4 BD+C: Homes","EQ","C","Contaminant control","EQ109",{"$f":"IF(EQ!$J$160>0,\"X\",\"\")","v":""},{"$f":"EQ!$J$160","v":0},2,null,null,null,"Option 1","EQ09O1",{"$f":"IF(EQ!$J$164>0,\"X\",\"\")","v":""}]
["LEED v4 BD+C: Homes","EQ","C","Contaminant control","EQ109",{"$f":"IF(EQ!$J$160>0,\"X\",\"\")","v":""},{"$f":"EQ!$J$160","v":0},2,null,null,null,"Option 2","EQ09O2",{"$f":"IF(EQ!$J$173>0,\"X\",\"\")","v":""}]
["LEED v4 BD+C: Homes","EQ","C","Contaminant control","EQ109",{"$f":"IF(EQ!$J$160>0,\"X\",\"\")","v":""},{"$f":"EQ!$J$160","v":0},2,null,null,null,"Option 3","EQ09O3",{"$f":"IF(EQ!$J$181>0,\"X\",\"\")","v":""}]
["LEED v4 BD+C: Homes","EQ","C","Contaminant control","EQ109",{"$f":"IF(EQ!$J$160>0,\"X\",\"\")","v":""},{"$f":"EQ!$J$160","v":0},2,null,null,null,"Option 4","EQ09O4",{"$f":"IF(EQ!$J$194>0,\"X\",\"\")","v":""}]
["LEED v4 BD+C: Homes","EQ","C","Balancing of heating and cooling distribution systems","EQ110",{"$f":"IF(EQ!$J$256>0,\"X\",\"\")","v":""},{"$f":"EQ!$J$256","v":0},3,null,null,null,"Case 1","EQ10O1",{"$f":"IF(EQ!$J$260>0,\"X\",\"\")","v":""}]
["LEED v4 BD+C: Homes","EQ","C","Balancing of heating and cooling distribution systems","EQ110",{"$f":"IF(EQ!$J$256>0,\"X\",\"\")","v":""},{"$f":"EQ!$J$256","v":0},3,null,null,null,"Case 1","EQ10O1",{"$f":"IF(EQ!$J$260>0,\"X\",\"\")","v":""},"Option 1","EQ10O1P1",{"$f":"IF(EQ!$J$263>0,\"X\",\"\")","v":""}]
["LEED v4 BD+C: Homes","EQ","C","Balancing of heating and cooling distribution systems","EQ110",{"$f":"IF(EQ!$J$256>0,\"X\",\"\")","v":""},{"$f":"EQ!$J$256","v":0},3,null,null,null,"Case 1","EQ10O1",{"$f":"IF(EQ!$J$260>0,\"X\",\"\")","v":""},"Option 2","EQ10O1P2",{"$f":"IF(EQ!$J$272>0,\"X\",\"\")","v":""}]
["LEED v4 BD+C: Homes","EQ","C","Balancing of heating and cooling distribution systems","EQ110",{"$f":"IF(EQ!$J$256>0,\"X\",\"\")","v":""},{"$f":"EQ!$J$256","v":0},3,null,null,null,"Case 1","EQ10O1",{"$f":"IF(EQ!$J$260>0,\"X\",\"\")","v":""},"Option 3","EQ10O1P3",{"$f":"IF(EQ!$J$284>0,\"X\",\"\")","v":""}]
["LEED v4 BD+C: Homes","EQ","C","Balancing of heating and cooling distribution systems","EQ110",{"$f":"IF(EQ!$J$256>0,\"X\",\"\")","v":""},{"$f":"EQ!$J$256","v":0},3,null,null,null,"Case 2","EQ10O2",{"$f":"IF(EQ!#REF!>0,\"X\",\"\")","v":{"$error":"#REF!"}}]
["LEED v4 BD+C: Homes","EQ","C","Balancing of heating and cooling distribution systems","EQ110",{"$f":"IF(EQ!$J$256>0,\"X\",\"\")","v":""},{"$f":"EQ!$J$256","v":0},3,null,null,null,"Case 2","EQ10O2",{"$f":"IF(EQ!#REF!>0,\"X\",\"\")","v":{"$error":"#REF!"}},"Option 1","EQ10O2P1",{"$f":"IF(EQ!#REF!>0,\"X\",\"\")","v":{"$error":"#REF!"}}]
["LEED v4 BD+C: Homes","EQ","C","Balancing of heating and cooling distribution systems","EQ110",{"$f":"IF(EQ!$J$256>0,\"X\",\"\")","v":""},{"$f":"EQ!$J$256","v":0},3,null,null,null,"Case 2","EQ10O2",{"$f":"IF(EQ!#REF!>0,\"X\",\"\")","v":{"$error":"#REF!"}},"Option 2","EQ10O2P2",{"$f":"IF(EQ!#REF!>0,\"X\",\"\")","v":{"$error":"#REF!"}}]
["LEED v4 BD+C: Homes","EQ","C","Enhanced compartmentalization","EQ111",{"$f":"IF(EQ!#REF!>0,\"X\",\"\")","v":{"$error":"#REF!"}},{"$f":"EQ!#REF!","v":{"$error":"#REF!"}},1]
["LEED v4 BD+C: Homes","EQ","C","Enhanced combustion venting","EQ112",{"$f":"IF(EQ!#REF!>0,\"X\",\"\")","v":{"$error":"#REF!"}},{"$f":"EQ!#REF!","v":{"$error":"#REF!"}},2,null,null,null,"Option 1","EQ12O1",{"$f":"IF(EQ!#REF!>0,\"X\",\"\")","v":{"$error":"#REF!"}}]
["LEED v4 BD+C: Homes","EQ","C","Enhanced combustion venting","EQ112",{"$f":"IF(EQ!#REF!>0,\"X\",\"\")","v":{"$error":"#REF!"}},{"$f":"EQ!#REF!","v":{"$error":"#REF!"}},2,null,null,null,"Option 2","EQ12O2",{"$f":"IF(EQ!#REF!>0,\"X\",\"\")","v":{"$error":"#REF!"}}]
["LEED v4 BD+C: Homes","EQ","C","Enhanced garage pollutant protection","EQ113",{"$f":"IF(EQ!#REF!>0,\"X\",\"\")","v":{"$error":"#REF!"}},{"$f":"EQ!#REF!","v":{"$error":"#REF!"}},2,null,null,null,"Case 1","EQ13O1",{"$f":"IF(EQ!#REF!>0,\"X\",\"\")","v":{"$error":"#REF!"}}]
["LEED v4 BD+C: Homes","EQ","C","Enhanced garage pollutant protection","EQ113",{"$f":"IF(EQ!#REF!>0,\"X\",\"\")","v":{"$error":"#REF!"}},{"$f":"EQ!#REF!","v":{"$error":"#REF!"}},2,null,null,null,"Case 1","EQ13O1",{"$f":"IF(EQ!#REF!>0,\"X\",\"\")","v":{"$error":"#REF!"}},"Option 1","EQ13O1P1",{"$f":"IF(EQ!#REF!>0,\"X\",\"\")","v":{"$error":"#REF!"}}]
["LEED v4 BD+C: Homes","EQ","C","Enhanced garage pollutant protection","EQ113",{"$f":"IF(EQ!#REF!>0,\"X\",\"\")","v":{"$error":"#REF!"}},{"$f":"EQ!#REF!","v":{"$error":"#REF!"}},2,null,null,null,"Case 1","EQ13O1",{"$f":"IF(EQ!#REF!>0,\"X\",\"\")","v":{"$error":"#REF!"}},"Option 2","EQ13O1P2",{"$f":"IF(EQ!#REF!>0,\"X\",\"\")","v":{"$error":"#REF!"}}]
["LEED v4 BD+C: Homes","EQ","C","Enhanced garage pollutant protection","EQ113",{"$f":"IF(EQ!#REF!>0,\"X\",\"\")","v":{"$error":"#REF!"}},{"$f":"EQ!#REF!","v":{"$error":"#REF!"}},2,null,null,null,"Case 2","EQ13O2",{"$f":"IF(EQ!#REF!>0,\"X\",\"\")","v":{"$error":"#REF!"}}]
["LEED v4 BD+C: Homes","EQ","C","Enhanced garage pollutant protection","EQ113",{"$f":"IF(EQ!#REF!>0,\"X\",\"\")","v":{"$error":"#REF!"}},{"$f":"EQ!#REF!","v":{"$error":"#REF!"}},2,null,null,null,"Case 2","EQ13O2",{"$f":"IF(EQ!#REF!>0,\"X\",\"\")","v":{"$error":"#REF!"}},"Option 1","EQ13O2P1",{"$f":"IF(EQ!#REF!>0,\"X\",\"\")","v":{"$error":"#REF!"}}]
["LEED v4 BD+C: Homes","EQ","C","Enhanced garage pollutant protection","EQ113",{"$f":"IF(EQ!#REF!>0,\"X\",\"\")","v":{"$error":"#REF!"}},{"$f":"EQ!#REF!","v":{"$error":"#REF!"}},2,null,null,null,"Case 2","EQ13O2",{"$f":"IF(EQ!#REF!>0,\"X\",\"\")","v":{"$error":"#REF!"}},"Option 2","EQ13O2P2",{"$f":"IF(EQ!#REF!>0,\"X\",\"\")","v":{"$error":"#REF!"}}]
["LEED v4 BD+C: Homes","EQ","C","Enhanced garage pollutant protection","EQ113",{"$f":"IF(EQ!#REF!>0,\"X\",\"\")","v":{"$error":"#REF!"}},{"$f":"EQ!#REF!","v":{"$error":"#REF!"}},2,null,null,null,"Case 2","EQ13O2",{"$f":"IF(EQ!#REF!>0,\"X\",\"\")","v":{"$error":"#REF!"}},"Option 3","EQ13O2P3",{"$f":"IF(EQ!#REF!>0,\"X\",\"\")","v":{"$error":"#REF!"}}]
["LEED v4 BD+C: Homes","EQ","C","Low-emitting products","EQ114",{"$f":"IF(EQ!$J$337>0,\"X\",\"\")","v":""},{"$f":"EQ!$J$337","v":0},3,"0.5 points","EQ14T1",{"$f":"IF(G380=0.5,\"X\",\"\")","v":""}]
["LEED v4 BD+C: Homes","EQ","C","Low-emitting products","EQ114",{"$f":"IF(EQ!$J$337>0,\"X\",\"\")","v":""},{"$f":"EQ!$J$337","v":0},3,"1 point","EQ14T2",{"$f":"IF(G381=1,\"X\",\"\")","v":""}]
["LEED v4 BD+C: Homes","EQ","C","Low-emitting products","EQ114",{"$f":"IF(EQ!$J$337>0,\"X\",\"\")","v":""},{"$f":"EQ!$J$337","v":0},3,"1.5 points","EQ14T3",{"$f":"IF(G382=1.5,\"X\",\"\")","v":""}]
["LEED v4 BD+C: Homes","EQ","C","Low-emitting products","EQ114",{"$f":"IF(EQ!$J$337>0,\"X\",\"\")","v":""},{"$f":"EQ!$J$337","v":0},3,"2 points","EQ14T4",{"$f":"IF(G383=2,\"X\",\"\")","v":""}]
["LEED v4 BD+C: Homes","EQ","C","Low-emitting products","EQ114",{"$f":"IF(EQ!$J$337>0,\"X\",\"\")","v":""},{"$f":"EQ!$J$337","v":0},3,"2.5 points","EQ14T5",{"$f":"IF(G384=2.5,\"X\",\"\")","v":""}]
["LEED v4 BD+C: Homes","EQ","C","Low-emitting products","EQ114",{"$f":"IF(EQ!$J$337>0,\"X\",\"\")","v":""},{"$f":"EQ!$J$337","v":0},3,"3 points","EQ14T6",{"$f":"IF(G385=3,\"X\",\"\")","v":""}]
["LEED v4 BD+C: Homes","IN","P","Preliminary rating","IN101","x",{"$f":"IN!$J$7","v":"N"},0]
["LEED v4 BD+C: Homes","IN","C","Innovation","IN102",{"$f":"IF(IN!$J$15>0,\"X\",\"\")","v":""},{"$f":"IN!$J$15","v":0},5,null,null,null,"Option 1","IN02O1",{"$f":"IF(IN!$J$18>0,\"X\",\"\")","v":""}]
["LEED v4 BD+C: Homes","IN","C","Innovation","IN102",{"$f":"IF(IN!$J$15>0,\"X\",\"\")","v":""},{"$f":"IN!$J$15","v":0},5,null,null,null,"Option 2","IN02O2",{"$f":"IF(IN!$J$25>0,\"X\",\"\")","v":""}]
["LEED v4 BD+C: Homes","IN","C","Innovation","IN102",{"$f":"IF(IN!$J$15>0,\"X\",\"\")","v":""},{"$f":"IN!$J$15","v":0},5,null,null,null,"Option 3","IN02O3",{"$f":"IF(IN!$J$31>0,\"X\",\"\")","v":""}]
["LEED v4 BD+C: Homes","IN","C","Innovation","IN102",{"$f":"IF(IN!$J$15>0,\"X\",\"\")","v":""},{"$f":"IN!$J$15","v":0},5,null,null,null,"Option 3","IN02O3",{"$f":"IF(IN!$J$31>0,\"X\",\"\")","v":""},"0.5 points","IN02O3P1",{"$f":"IF(IN!$J$31=0.5,\"X\",\"\")","v":""}]
["LEED v4 BD+C: Homes","IN","C","Innovation","IN102",{"$f":"IF(IN!$J$15>0,\"X\",\"\")","v":""},{"$f":"IN!$J$15","v":0},5,null,null,null,"Option 3","IN02O3",{"$f":"IF(IN!$J$31>0,\"X\",\"\")","v":""},"1 point","IN02O3P2",{"$f":"IF(IN!$J$31=1,\"X\",\"\")","v":""}]
["LEED v4 BD+C: Homes","IN","C","Innovation","IN102",{"$f":"IF(IN!$J$15>0,\"X\",\"\")","v":""},{"$f":"IN!$J$15","v":0},5,null,null,null,"Option 3","IN02O3",{"$f":"IF(IN!$J$31>0,\"X\",\"\")","v":""},"1.5 points","IN02O3P3",{"$f":"IF(IN!$J$31=1.5,\"X\",\"\")","v":""}]
["LEED v4 BD+C: Homes","IN","C","Innovation","IN102",{"$f":"IF(IN!$J$15>0,\"X\",\"\")","v":""},{"$f":"IN!$J$15","v":0},5,null,null,null,"Option 3","IN02O3",{"$f":"IF(IN!$J$31>0,\"X\",\"\")","v":""},"2 points","IN02O3P4",{"$f":"IF(IN!$J$31=2,\"X\",\"\")","v":""}]
["LEED v4 BD+C: Homes","IN","C","Innovation","IN102",{"$f":"IF(IN!$J$15>0,\"X\",\"\")","v":""},{"$f":"IN!$J$15","v":0},5,null,null,null,"Option 3","IN02O3",{"$f":"IF(IN!$J$31>0,\"X\",\"\")","v":""},"2.5 points","IN02O3P5",{"$f":"IF(IN!$J$31=2.5,\"X\",\"\")","v":""}]
["LEED v4 BD+C: Homes","IN","C","Innovation","IN102",{"$f":"IF(IN!$J$15>0,\"X\",\"\")","v":""},{"$f":"IN!$J$15","v":0},5,null,null,null,"Option 3","IN02O3",{"$f":"IF(IN!$J$31>0,\"X\",\"\")","v":""},"3 points","IN02O3P6",{"$f":"IF(IN!$J$31=3,\"X\",\"\")","v":""}]
["LEED v4 BD+C: Homes","IN","C","LEED Accredited Professional","IN103",{"$f":"IF(IN!$J$49>0,\"X\",\"\")","v":""},{"$f":"IN!$J$49","v":0},1]
[]
["LEED v4 BD+C: Midrise","IP","C","Integrative process","IP102",{"$f":"IF(IP!$J$7>0,\"X\",\"\")","v":""},{"$f":"IP!$J$7","v":0},2,null,null,null,"Option 1","IP02O1",{"$f":"IF(IP!$J$11>0,\"X\",\"\")","v":""}]
["LEED v4 BD+C: Midrise","IP","C","Integrative process","IP102",{"$f":"IF(IP!$J$7>0,\"X\",\"\")","v":""},{"$f":"IP!$J$7","v":0},2,null,null,null,"Option 2","IP02O2",{"$f":"IF(IP!$J$33>0,\"X\",\"\")","v":""}]
["LEED v4 BD+C: Midrise","IP","C","Integrative process","IP102",{"$f":"IF(IP!$J$7>0,\"X\",\"\")","v":""},{"$f":"IP!$J$7","v":0},2,null,null,null,"Option 3","IP02O3",{"$f":"IF(IP!$J$42>0,\"X\",\"\")","v":""}]
["LEED v4 BD+C: Midrise","LT","P","Floodplain avoidance","LT101","x",{"$f":"LT!$J$7","v":"N"},0]
["LEED v4 BD+C: Midrise","LT","C","LEED for Neighborhood Development","LT102",{"$f":"IF(LT!$J$19>0,\"X\",\"\")","v":""},{"$f":"LT!$J$19","v":0},15]
["LEED v4 BD+C: Midrise","LT","C","Site selection","LT103",{"$f":"IF(LT!$J$32>0,\"X\",\"\")","v":""},{"$f":"LT!$J$32","v":0},8,null,null,null,"Option 1","LT03O1",{"$f":"IF(LT!$J$36>0,\"X\",\"\")","v":""}]
["LEED v4 BD+C: Midrise","LT","C","Site selection","LT103",{"$f":"IF(LT!$J$32>0,\"X\",\"\")","v":""},{"$f":"LT!$J$32","v":0},8,null,null,null,"Option 1","LT03O1",{"$f":"IF(LT!$J$36>0,\"X\",\"\")","v":""},"Path 1","LT03O1P1",{"$f":"IF(LT!$J$39>0,\"X\",\"\")","v":""}]
["LEED v4 BD+C: Midrise","LT","C","Site selection","LT103",{"$f":"IF(LT!$J$32>0,\"X\",\"\")","v":""},{"$f":"LT!$J$32","v":0},8,null,null,null,"Option 1","LT03O1",{"$f":"IF(LT!$J$36>0,\"X\",\"\")","v":""},"Path 2","LT03O1P2",{"$f":"IF(LT!$J$47>0,\"X\",\"\")","v":""}]
["LEED v4 BD+C: Midrise","LT","C","Site selection","LT103",{"$f":"IF(LT!$J$32>0,\"X\",\"\")","v":""},{"$f":"LT!$J$32","v":0},8,null,null,null,"Option 2","LT03O2",{"$f":"IF(LT!$J$62>0,\"X\",\"\")","v":""}]
["LEED v4 BD+C: Midrise","LT","C","Site selection","LT103",{"$f":"IF(LT!$J$32>0,\"X\",\"\")","v":""},{"$f":"LT!$J$32","v":0},8,null,null,null,"Option 3","LT03O3",{"$f":"IF(LT!$J$71>0,\"X\",\"\")","v":""}]
["LEED v4 BD+C: Midrise","LT","C","Site selection","LT103",{"$f":"IF(LT!$J$32>0,\"X\",\"\")","v":""},{"$f":"LT!$J$32","v":0},8,null,null,null,"Option 4","LT03O4",{"$f":"IF(LT!$J$79>0,\"X\",\"\")","v":""}]
["LEED v4 BD+C: Midrise","LT","C","Site selection","LT103",{"$f":"IF(LT!$J$32>0,\"X\",\"\")","v":""},{"$f":"LT!$J$32","v":0},8,null,null,null,"Option 5","LT03O5",{"$f":"IF(LT!$J$85>0,\"X\",\"\")","v":""}]
["LEED v4 BD+C: Midrise","LT","C","Compact development","LT104",{"$f":"IF(LT!$J$111>0,\"X\",\"\")","v":""},{"$f":"LT!$J$111","v":0},3,"1 point","LT04T1",{"$f":"IF($G$31=1,\"X\",\"\")","v":""}]
["LEED v4 BD+C: Midrise","LT","C","Compact development","LT104",{"$f":"IF(LT!$J$111>0,\"X\",\"\")","v":""},{"$f":"LT!$J$111","v":0},3,"2 points","LT04T2",{"$f":"IF($G$32=2,\"X\",\"\")","v":""}]
["LEED v4 BD+C: Midrise","LT","C","Compact development","LT104",{"$f":"IF(LT!$J$111>0,\"X\",\"\")","v":""},{"$f":"LT!$J$111","v":0},3,"3 points","LT04T3",{"$f":"IF($G$33=3,\"X\",\"\")","v":""}]
["LEED v4 BD+C: Midrise","LT","C","Community resources","LT105",{"$f":"IF(LT!$J$122>0,\"X\",\"\")","v":""},{"$f":"LT!$J$122","v":0},2,"1 point","LT05T1",{"$f":"IF($G$34=1,\"X\",\"\")","v":""}]
["LEED v4 BD+C: Midrise","LT","C","Community resources","LT105",{"$f":"IF(LT!$J$122>0,\"X\",\"\")","v":""},{"$f":"LT!$J$122","v":0},2,"1.5 points","LT05T2",{"$f":"IF($G$35=1.5,\"X\",\"\")","v":""}]
["LEED v4 BD+C: Midrise","LT","C","Community resources","LT105",{"$f":"IF(LT!$J$122>0,\"X\",\"\")","v":""},{"$f":"LT!$J$122","v":0},2,"2 points","LT05T3",{"$f":"IF($G$36=2,\"X\",\"\")","v":""}]
["LEED v4 BD+C: Midrise","LT","C","Access to transit","LT106",{"$f":"IF(LT!$J$130>0,\"X\",\"\")","v":""},{"$f":"LT!$J$130","v":0},2,"1 point","LT06T1",{"$f":"IF($G$37=1,\"X\",\"\")","v":""}]
["LEED v4 BD+C: Midrise","LT","C","Access to transit","LT106",{"$f":"IF(LT!$J$130>0,\"X\",\"\")","v":""},{"$f":"LT!$J$130","v":0},2,"1.5 points","LT06T2",{"$f":"IF($G$38=1.5,\"X\",\"\")","v":""}]
["LEED v4 BD+C: Midrise","LT","C","Access to transit","LT106",{"$f":"IF(LT!$J$130>0,\"X\",\"\")","v":""},{"$f":"LT!$J$130","v":0},2,"2 points","LT06T3",{"$f":"IF($G$39=2,\"X\",\"\")","v":""}]
["LEED v4 BD+C: Midrise","SS","P","Construction activity pollution prevention","SS101","x",{"$f":"SS!$J$7","v":"N"},0]
["LEED v4 BD+C: Midrise","SS","P","No invasive plants","SS102","x",{"$f":"SS!#REF!","v":{"$error":"#REF!"}},0]
["LEED v4 BD+C: Midrise","SS","C","Heat island reduction","SS110",{"$f":"IF(SS!$J$34>0,\"X\",\"\")","v":""},{"$f":"SS!$J$34","v":0},2,null,null,null,"Option 1","SS10O1",{"$f":"IF(SS!$J$38>0,\"X\",\"\")","v":""}]
["LEED v4 BD+C: Midrise","SS","C","Heat island reduction","SS110",{"$f":"IF(SS!$J$34>0,\"X\",\"\")","v":""},{"$f":"SS!$J$34","v":0},2,null,null,null,"Option 1","SS10O1",{"$f":"IF(SS!$J$38>0,\"X\",\"\")","v":""},"1 point","SS10O1P1",{"$f":"IF(SS!$J$38=1,\"X\",\"\")","v":""}]
["LEED v4 BD+C: Midrise","SS","C","Heat island reduction","SS110",{"$f":"IF(SS!$J$34>0,\"X\",\"\")","v":""},{"$f":"SS!$J$34","v":0},2,null,null,null,"Option 1","SS10O1",{"$f":"IF(SS!$J$38>0,\"X\",\"\")","v":""},"2 points","SS10O1P2",{"$f":"IF(SS!$J$38=2,\"X\",\"\")","v":""}]
["LEED v4 BD+C: Midrise","SS","C","Heat island reduction","SS110",{"$f":"IF(SS!$J$34>0,\"X\",\"\")","v":""},{"$f":"SS!$J$34","v":0},2,null,null,null,"Option 2","SS10O2",{"$f":"IF(SS!#REF!>0,\"X\",\"\")","v":{"$error":"#REF!"}}]
["LEED v4 BD+C: Midrise","SS","C","Heat island reduction","SS110",{"$f":"IF(SS!$J$34>0,\"X\",\"\")","v":""},{"$f":"SS!$J$34","v":0},2,null,null,null,"Option 2","SS10O2",{"$f":"IF(SS!#REF!>0,\"X\",\"\")","v":{"$error":"#REF!"}},"1 point","SS10O2P1",{"$f":"IF(SS!#REF!=1,\"X\",\"\")","v":{"$error":"#REF!"}}]
["LEED v4 BD+C: Midrise","SS","C","Heat island reduction","SS110",{"$f":"IF(SS!$J$34>0,\"X\",\"\")","v":""},{"$f":"SS!$J$34","v":0},2,null,null,null,"Option 2","SS10O2",{"$f":"IF(SS!#REF!>0,\"X\",\"\")","v":{"$error":"#REF!"}},"2 points","SS10O2P2",{"$f":"IF(SS!#REF!=2,\"X\",\"\")","v":{"$error":"#REF!"}}]
["LEED v4 BD+C: Midrise","SS","C","Rainwater management","SS108",{"$f":"IF(SS!$J$66>0,\"X\",\"\")","v":""},{"$f":"SS!$J$66","v":0},3,null,null,null,"Case 1","SS08O1",{"$f":"IF(SS!$J$71>0,\"X\",\"\")","v":""}]
["LEED v4 BD+C: Midrise","SS","C","Rainwater management","SS108",{"$f":"IF(SS!$J$66>0,\"X\",\"\")","v":""},{"$f":"SS!$J$66","v":0},3,null,null,null,"Case 1","SS08O1",{"$f":"IF(SS!$J$71>0,\"X\",\"\")","v":""},"1 point","SS08O1P1",{"$f":"IF(SS!$J$71=1,\"X\",\"\")","v":""}]
["LEED v4 BD+C: Midrise","SS","C","Rainwater management","SS108",{"$f":"IF(SS!$J$66>0,\"X\",\"\")","v":""},{"$f":"SS!$J$66","v":0},3,null,null,null,"Case 1","SS08O1",{"$f":"IF(SS!$J$71>0,\"X\",\"\")","v":""},"2 points","SS08O1P2",{"$f":"IF(SS!$J$71=2,\"X\",\"\")","v":""}]
["LEED v4 BD+C: Midrise","SS","C","Rainwater management","SS108",{"$f":"IF(SS!$J$66>0,\"X\",\"\")","v":""},{"$f":"SS!$J$66","v":0},3,null,null,null,"Case 1","SS08O1",{"$f":"IF(SS!$J$71>0,\"X\",\"\")","v":""},"3 points","SS08O1P3",{"$f":"IF(SS!$J$71=3,\"X\",\"\")","v":""}]
["LEED v4 BD+C: Midrise","SS","C","Rainwater management","SS108",{"$f":"IF(SS!$J$66>0,\"X\",\"\")","v":""},{"$f":"SS!$J$66","v":0},3,null,null,null,"Case 2","SS08O2",{"$f":"IF(SS!$J$100>0,\"X\",\"\")","v":""}]
["LEED v4 BD+C: Midrise","SS","C","Rainwater management","SS108",{"$f":"IF(SS!$J$66>0,\"X\",\"\")","v":""},{"$f":"SS!$J$66","v":0},3,null,null,null,"Case 2","SS08O2",{"$f":"IF(SS!$J$100>0,\"X\",\"\")","v":""},"2 points","SS08O2P1",{"$f":"IF(SS!$J$100=2,\"X\",\"\")","v":""}]
["LEED v4 BD+C: Midrise","SS","C","Rainwater management","SS108",{"$f":"IF(SS!$J$66>0,\"X\",\"\")","v":""},{"$f":"SS!$J$66","v":0},3,null,null,null,"Case 2","SS08O2",{"$f":"IF(SS!$J$100>0,\"X\",\"\")","v":""},"3 points","SS08O2P2",{"$f":"IF(SS!$J$100=3,\"X\",\"\")","v":""}]
["LEED v4 BD+C: Midrise","SS","C","Nontoxic pest control","SS112",{"$f":"IF(SS!$J$122>0,\"X\",\"\")","v":""},{"$f":"SS!$J$122","v":0},2,"0.5 points","SS12T1",{"$f":"IF($G$55=0.5,\"X\",\"\")","v":""}]
["LEED v4 BD+C: Midrise","SS","C","Nontoxic pest control","SS112",{"$f":"IF(SS!$J$122>0,\"X\",\"\")","v":""},{"$f":"SS!$J$122","v":0},2,"1 point","SS12T2",{"$f":"IF($G$56=1,\"X\",\"\")","v":""}]
["LEED v4 BD+C: Midrise","SS","C","Nontoxic pest control","SS112",{"$f":"IF(SS!$J$122>0,\"X\",\"\")","v":""},{"$f":"SS!$J$122","v":0},2,"1.5 points","SS12T3",{"$f":"IF($G$57=1.5,\"X\",\"\")","v":""}]
["LEED v4 BD+C: Midrise","SS","C","Nontoxic pest control","SS112",{"$f":"IF(SS!$J$122>0,\"X\",\"\")","v":""},{"$f":"SS!$J$122","v":0},2,"2 points","SS12T4",{"$f":"IF($G$58=2,\"X\",\"\")","v":""}]
["LEED v4 BD+C: Midrise","WE","P","Water metering","WE101","x",{"$f":"WE!$J$23","v":0},0,null,null,null,"Case 1","WE01O1",{"$f":"IF(WE!#REF!=\"Y\",\"X\",\"\")","v":{"$error":"#REF!"}}]
["LEED v4 BD+C: Midrise","WE","P","Water metering","WE101","x",{"$f":"WE!$J$23","v":0},0,null,null,null,"Case 2","WE01O2",{"$f":"IF(WE!#REF!=\"Y\",\"X\",\"\")","v":{"$error":"#REF!"}}]
["LEED v4 BD+C: Midrise","WE","C","Total water use","WE102",{"$f":"IF(WE!$J$32>0,\"X\",\"\")","v":""},{"$f":"WE!$J$32","v":0},12,"1 point","WE02T1",{"$f":"IF($G$61=1,\"X\",\"\")","v":""}]
["LEED v4 BD+C: Midrise","WE","C","Total water use","WE102",{"$f":"IF(WE!$J$32>0,\"X\",\"\")","v":""},{"$f":"WE!$J$32","v":0},12,"2 points","WE02T2",{"$f":"IF($G$62=2,\"X\",\"\")","v":""}]
["LEED v4 BD+C: Midrise","WE","C","Total water use","WE102",{"$f":"IF(WE!$J$32>0,\"X\",\"\")","v":""},{"$f":"WE!$J$32","v":0},12,"3 points","WE02T3",{"$f":"IF($G$63=3,\"X\",\"\")","v":""}]
["LEED v4 BD+C: Midrise","WE","C","Total water use","WE102",{"$f":"IF(WE!$J$32>0,\"X\",\"\")","v":""},{"$f":"WE!$J$32","v":0},12,"4 points","WE02T4",{"$f":"IF($G$64=4,\"X\",\"\")","v":""}]
["LEED v4 BD+C: Midrise","WE","C","Total water use","WE102",{"$f":"IF(WE!$J$32>0,\"X\",\"\")","v":""},{"$f":"WE!$J$32","v":0},12,"5 points","WE02T5",{"$f":"IF($G$65=5,\"X\",\"\")","v":""}]
["LEED v4 BD+C: Midrise","WE","C","Total water use","WE102",{"$f":"IF(WE!$J$32>0,\"X\",\"\")","v":""},{"$f":"WE!$J$32","v":0},12,"6 points","WE02T6",{"$f":"IF($G$66=6,\"X\",\"\")","v":""}]
["LEED v4 BD+C: Midrise","WE","C","Total water use","WE102",{"$f":"IF(WE!$J$32>0,\"X\",\"\")","v":""},{"$f":"WE!$J$32","v":0},12,"7 points","WE02T7",{"$f":"IF($G$67=7,\"X\",\"\")","v":""}]
["LEED v4 BD+C: Midrise","WE","C","Total water use","WE102",{"$f":"IF(WE!$J$32>0,\"X\",\"\")","v":""},{"$f":"WE!$J$32","v":0},12,"8 points","WE02T8",{"$f":"IF($G$68=8,\"X\",\"\")","v":""}]
["LEED v4 BD+C: Midrise","WE","C","Total water use","WE102",{"$f":"IF(WE!$J$32>0,\"X\",\"\")","v":""},{"$f":"WE!$J$32","v":0},12,"9 points","WE02T9",{"$f":"IF($G$69=9,\"X\",\"\")","v":""}]
["LEED v4 BD+C: Midrise","WE","C","Total water use","WE102",{"$f":"IF(WE!$J$32>0,\"X\",\"\")","v":""},{"$f":"WE!$J$32","v":0},12,"10 points","WE02T10",{"$f":"IF($G$70=10,\"X\",\"\")","v":""}]
["LEED v4 BD+C: Midrise","WE","C","Total water use","WE102",{"$f":"IF(WE!$J$32>0,\"X\",\"\")","v":""},{"$f":"WE!$J$32","v":0},12,"11 points","WE02T11",{"$f":"IF($G$71=11,\"X\",\"\")","v":""}]
["LEED v4 BD+C: Midrise","WE","C","Total water use","WE102",{"$f":"IF(WE!$J$32>0,\"X\",\"\")","v":""},{"$f":"WE!$J$32","v":0},12,"12 points","WE02T12",{"$f":"IF($G$72=12,\"X\",\"\")","v":""}]
["LEED v4 BD+C: Midrise","WE","C","Indoor water use","WE103",{"$f":"IF(WE!$J$43>0,\"X\",\"\")","v":""},{"$f":"WE!$J$43","v":0},6,null,null,null,"Case 1","WE03O1",{"$f":"IF(WE!#REF!>0,\"X\",\"\")","v":{"$error":"#REF!"}}]
["LEED v4 BD+C: Midrise","WE","C","Indoor water use","WE103",{"$f":"IF(WE!$J$43>0,\"X\",\"\")","v":""},{"$f":"WE!$J$43","v":0},6,null,null,null,"Case 1","WE03O1",{"$f":"IF(WE!#REF!>0,\"X\",\"\")","v":{"$error":"#REF!"}},"1 point","WE03O1P1",{"$f":"IF(WE!#REF!=1,\"X\",\"\")","v":{"$error":"#REF!"}}]
["LEED v4 BD+C: Midrise","WE","C","Indoor water use","WE103",{"$f":"IF(WE!$J$43>0,\"X\",\"\")","v":""},{"$f":"WE!$J$43","v":0},6,null,null,null,"Case 1","WE03O1",{"$f":"IF(WE!#REF!>0,\"X\",\"\")","v":{"$error":"#REF!"}},"2 points","WE03O1P2",{"$f":"IF(WE!#REF!=2,\"X\",\"\")","v":{"$error":"#REF!"}}]
["LEED v4 BD+C: Midrise","WE","C","Indoor water use","WE103",{"$f":"IF(WE!$J$43>0,\"X\",\"\")","v":""},{"$f":"WE!$J$43","v":0},6,null,null,null,"Case 1","WE03O1",{"$f":"IF(WE!#REF!>0,\"X\",\"\")","v":{"$error":"#REF!"}},"3 points","WE03O1P3",{"$f":"IF(WE!#REF!=3,\"X\",\"\")","v":{"$error":"#REF!"}}]
["LEED v4 BD+C: Midrise","WE","C","Indoor water use","WE103",{"$f":"IF(WE!$J$43>0,\"X\",\"\")","v":""},{"$f":"WE!$J$43","v":0},6,null,null,null,"Case 1","WE03O1",{"$f":"IF(WE!#REF!>0,\"X\",\"\")","v":{"$error":"#REF!"}},"4 points","WE03O1P4",{"$f":"IF(WE!#REF!=4,\"X\",\"\")","v":{"$error":"#REF!"}}]
["LEED v4 BD+C: Midrise","WE","C","Indoor water use","WE103",{"$f":"IF(WE!$J$43>0,\"X\",\"\")","v":""},{"$f":"WE!$J$43","v":0},6,null,null,null,"Case 1","WE03O1",{"$f":"IF(WE!#REF!>0,\"X\",\"\")","v":{"$error":"#REF!"}},"5 points","WE03O1P5",{"$f":"IF(WE!#REF!=5,\"X\",\"\")","v":{"$error":"#REF!"}}]
["LEED v4 BD+C: Midrise","WE","C","Indoor water use","WE103",{"$f":"IF(WE!$J$43>0,\"X\",\"\")","v":""},{"$f":"WE!$J$43","v":0},6,null,null,null,"Case 1","WE03O1",{"$f":"IF(WE!#REF!>0,\"X\",\"\")","v":{"$error":"#REF!"}},"6 points","WE03O1P6",{"$f":"IF(WE!#REF!=6,\"X\",\"\")","v":{"$error":"#REF!"}}]
["LEED v4 BD+C: Midrise","WE","C","Indoor water use","WE103",{"$f":"IF(WE!$J$43>0,\"X\",\"\")","v":""},{"$f":"WE!$J$43","v":0},6,null,null,null,"Case 2","WE03O2",{"$f":"IF(WE!#REF!>0,\"X\",\"\")","v":{"$error":"#REF!"}}]
["LEED v4 BD+C: Midrise","WE","C","Indoor water use","WE103",{"$f":"IF(WE!$J$43>0,\"X\",\"\")","v":""},{"$f":"WE!$J$43","v":0},6,null,null,null,"Case 2","WE03O2",{"$f":"IF(WE!#REF!>0,\"X\",\"\")","v":{"$error":"#REF!"}},"1 point","WE03O2P1",{"$f":"IF(WE!#REF!=1,\"X\",\"\")","v":{"$error":"#REF!"}}]
["LEED v4 BD+C: Midrise","WE","C","Indoor water use","WE103",{"$f":"IF(WE!$J$43>0,\"X\",\"\")","v":""},{"$f":"WE!$J$43","v":0},6,null,null,null,"Case 2","WE03O2",{"$f":"IF(WE!#REF!>0,\"X\",\"\")","v":{"$error":"#REF!"}},"2 points","WE03O2P2",{"$f":"IF(WE!#REF!=2,\"X\",\"\")","v":{"$error":"#REF!"}}]
["LEED v4 BD+C: Midrise","WE","C","Indoor water use","WE103",{"$f":"IF(WE!$J$43>0,\"X\",\"\")","v":""},{"$f":"WE!$J$43","v":0},6,null,null,null,"Case 2","WE03O2",{"$f":"IF(WE!#REF!>0,\"X\",\"\")","v":{"$error":"#REF!"}},"3 points","WE03O2P3",{"$f":"IF(WE!#REF!=3,\"X\",\"\")","v":{"$error":"#REF!"}}]
["LEED v4 BD+C: Midrise","WE","C","Indoor water use","WE103",{"$f":"IF(WE!$J$43>0,\"X\",\"\")","v":""},{"$f":"WE!$J$43","v":0},6,null,null,null,"Case 2","WE03O2",{"$f":"IF(WE!#REF!>0,\"X\",\"\")","v":{"$error":"#REF!"}},"4 points","WE03O2P4",{"$f":"IF(WE!#REF!=4,\"X\",\"\")","v":{"$error":"#REF!"}}]
["LEED v4 BD+C: Midrise","WE","C","Indoor water use","WE103",{"$f":"IF(WE!$J$43>0,\"X\",\"\")","v":""},{"$f":"WE!$J$43","v":0},6,null,null,null,"Case 2","WE03O2",{"$f":"IF(WE!#REF!>0,\"X\",\"\")","v":{"$error":"#REF!"}},"5 points","WE03O2P5",{"$f":"IF(WE!#REF!=5,\"X\",\"\")","v":{"$error":"#REF!"}}]
["LEED v4 BD+C: Midrise","WE","C","Indoor water use","WE103",{"$f":"IF(WE!$J$43>0,\"X\",\"\")","v":""},{"$f":"WE!$J$43","v":0},6,null,null,null,"Case 2","WE03O2",{"$f":"IF(WE!#REF!>0,\"X\",\"\")","v":{"$error":"#REF!"}},"6 points","WE03O2P6",{"$f":"IF(WE!#REF!=6,\"X\",\"\")","v":{"$error":"#REF!"}}]
["LEED v4 BD+C: Midrise","WE","C","Outdoor water use","WE104",{"$f":"IF(WE!$J$65>0,\"X\",\"\")","v":""},{"$f":"WE!$J$65","v":0},4,"1 point","WE04T1",{"$f":"IF(G466=1,\"X\",\"\")","v":""}]
["LEED v4 BD+C: Midrise","WE","C","Outdoor water use","WE104",{"$f":"IF(WE!$J$65>0,\"X\",\"\")","v":""},{"$f":"WE!$J$65","v":0},4,"2 points","WE04T2",{"$f":"IF(G467=2,\"X\",\"\")","v":""}]
["LEED v4 BD+C: Midrise","WE","C","Outdoor water use","WE104",{"$f":"IF(WE!$J$65>0,\"X\",\"\")","v":""},{"$f":"WE!$J$65","v":0},4,"3 points","WE04T3",{"$f":"IF(G468=3,\"X\",\"\")","v":""}]
["LEED v4 BD+C: Midrise","WE","C","Outdoor water use","WE104",{"$f":"IF(WE!$J$65>0,\"X\",\"\")","v":""},{"$f":"WE!$J$65","v":0},4,"4 points","WE04T4",{"$f":"IF(G469=4,\"X\",\"\")","v":""}]
["LEED v4 BD+C: Midrise","EA","P","Minimum energy performance","EA101","x",{"$f":"EA!$J$7","v":"N"},0,null,null,null,"Option 1","EA101O1",{"$f":"IF(EA!#REF!>0,\"X\",\"\")","v":{"$error":"#REF!"}}]
["LEED v4 BD+C: Midrise","EA","P","Minimum energy performance","EA101","x",{"$f":"EA!$J$7","v":"N"},0,null,null,null,"Option 2","EA101O2",{"$f":"IF(EA!#REF!>0,\"X\",\"\")","v":{"$error":"#REF!"}}]
["LEED v4 BD+C: Midrise","EA","P","Energy metering","EA102","x",{"$f":"EA!$J$30","v":0},0,null,null,null,"Case 1","EA02O1",{"$f":"IF(EA!#REF!=\"Y\",\"X\",\"\")","v":{"$error":"#REF!"}}]
["LEED v4 BD+C: Midrise","EA","P","Energy metering","EA102","x",{"$f":"EA!$J$30","v":0},0,null,null,null,"Case 2","EA02O2",{"$f":"IF(EA!#REF!=\"Y\",\"X\",\"\")","v":{"$error":"#REF!"}}]
["LEED v4 BD+C: Midrise","EA","P","Education of homeowner, tenant, or building manager","EA103","x",{"$f":"EA!$J$39","v":0},0,null,null,null,"Option 1","EA05O1",{"$f":"IF(EA!$J$52>0,\"X\",\"\")","v":"X"}]
["LEED v4 BD+C: Midrise","EA","C","Annual energy use","EA105",{"$f":"IF(EA!#REF!>0,\"X\",\"\")","v":{"$error":"#REF!"}},{"$f":"EA!#REF!","v":{"$error":"#REF!"}},30,"0.5 points","EA05T1",{"$f":"IF(G475=0.5,\"X\",\"\")","v":{"$error":"#REF!"}}]
["LEED v4 BD+C: Midrise","EA","C","Annual energy use","EA105",{"$f":"IF(EA!#REF!>0,\"X\",\"\")","v":{"$error":"#REF!"}},{"$f":"EA!#REF!","v":{"$error":"#REF!"}},30,"1 point","EA05T2",{"$f":"IF(G476=1,\"X\",\"\")","v":{"$error":"#REF!"}}]
["LEED v4 BD+C: Midrise","EA","C","Annual energy use","EA105",{"$f":"IF(EA!#REF!>0,\"X\",\"\")","v":{"$error":"#REF!"}},{"$f":"EA!#REF!","v":{"$error":"#REF!"}},30,"1.5 points","EA05T3",{"$f":"IF(G477=1.5,\"X\",\"\")","v":{"$error":"#REF!"}}]
["LEED v4 BD+C: Midrise","EA","C","Annual energy use","EA105",{"$f":"IF(EA!#REF!>0,\"X\",\"\")","v":{"$error":"#REF!"}},{"$f":"EA!#REF!","v":{"$error":"#REF!"}},30,"2 points","EA05T4",{"$f":"IF(G478=2,\"X\",\"\")","v":{"$error":"#REF!"}}]
["LEED v4 BD+C: Midrise","EA","C","Annual energy use","EA105",{"$f":"IF(EA!#REF!>0,\"X\",\"\")","v":{"$error":"#REF!"}},{"$f":"EA!#REF!","v":{"$error":"#REF!"}},30,"2.5 points","EA05T5",{"$f":"IF(G479=2.5,\"X\",\"\")","v":{"$error":"#REF!"}}]
["LEED v4 BD+C: Midrise","EA","C","Annual energy use","EA105",{"$f":"IF(EA!#REF!>0,\"X\",\"\")","v":{"$error":"#REF!"}},{"$f":"EA!#REF!","v":{"$error":"#REF!"}},30,"3 points","EA05T6",{"$f":"IF(G480=3,\"X\",\"\")","v":{"$error":"#REF!"}}]
["LEED v4 BD+C: Midrise","EA","C","Annual energy use","EA105",{"$f":"IF(EA!#REF!>0,\"X\",\"\")","v":{"$error":"#REF!"}},{"$f":"EA!#REF!","v":{"$error":"#REF!"}},30,"3.5 points","EA05T7",{"$f":"IF(G481=3.5,\"X\",\"\")","v":{"$error":"#REF!"}}]
["LEED v4 BD+C: Midrise","EA","C","Annual energy use","EA105",{"$f":"IF(EA!#REF!>0,\"X\",\"\")","v":{"$error":"#REF!"}},{"$f":"EA!#REF!","v":{"$error":"#REF!"}},30,"4 points","EA05T8",{"$f":"IF(G482=4,\"X\",\"\")","v":{"$error":"#REF!"}}]
["LEED v4 BD+C: Midrise","EA","C","Annual energy use","EA105",{"$f":"IF(EA!#REF!>0,\"X\",\"\")","v":{"$error":"#REF!"}},{"$f":"EA!#REF!","v":{"$error":"#REF!"}},30,"4.5 points","EA05T9",{"$f":"IF(G483=4.5,\"X\",\"\")","v":{"$error":"#REF!"}}]
["LEED v4 BD+C: Midrise","EA","C","Annual energy use","EA105",{"$f":"IF(EA!#REF!>0,\"X\",\"\")","v":{"$error":"#REF!"}},{"$f":"EA!#REF!","v":{"$error":"#REF!"}},30,"5 points","EA05T10",{"$f":"IF(G484=55,\"X\",\"\")","v":{"$error":"#REF!"}}]
["LEED v4 BD+C: Midrise","EA","C","Annual energy use","EA105",{"$f":"IF(EA!#REF!>0,\"X\",\"\")","v":{"$error":"#REF!"}},{"$f":"EA!#REF!","v":{"$error":"#REF!"}},30,"5.5 points","EA05T11",{"$f":"IF(G485=5.5,\"X\",\"\")","v":{"$error":"#REF!"}}]
["LEED v4 BD+C: Midrise","EA","C","Annual energy use","EA105",{"$f":"IF(EA!#REF!>0,\"X\",\"\")","v":{"$error":"#REF!"}},{"$f":"EA!#REF!","v":{"$error":"#REF!"}},30,"6 points","EA05T12",{"$f":"IF(G486=6,\"X\",\"\")","v":{"$error":"#REF!"}}]
["LEED v4 BD+C: Midrise","EA","C","Annual energy use","EA105",{"$f":"IF(EA!#REF!>0,\"X\",\"\")","v":{"$error":"#REF!"}},{"$f":"EA!#REF!","v":{"$error":"#REF!"}},30,"6.5 points","EA05T13",{"$f":"IF(G487=6.5,\"X\",\"\")","v":{"$error":"#REF!"}}]
["LEED v4 BD+C: Midrise","EA","C","Annual energy use","EA105",{"$f":"IF(EA!#REF!>0,\"X\",\"\")","v":{"$error":"#REF!"}},{"$f":"EA!#REF!","v":{"$error":"#REF!"}},30,"7 points","EA05T14",{"$f":"IF(G488=7,\"X\",\"\")","v":{"$error":"#REF!"}}]
["LEED v4 BD+C: Midrise","EA","C","Annual energy use","EA105",{"$f":"IF(EA!#REF!>0,\"X\",\"\")","v":{"$error":"#REF!"}},{"$f":"EA!#REF!","v":{"$error":"#REF!"}},30,"7.5 points","EA05T15",{"$f":"IF(G489=7.5,\"X\",\"\")","v":{"$error":"#REF!"}}]
["LEED v4 BD+C: Midrise","EA","C","Annual energy use","EA105",{"$f":"IF(EA!#REF!>0,\"X\",\"\")","v":{"$error":"#REF!"}},{"$f":"EA!#REF!","v":{"$error":"#REF!"}},30,"8 points","EA05T16",{"$f":"IF(G490=8,\"X\",\"\")","v":{"$error":"#REF!"}}]
["LEED v4 BD+C: Midrise","EA","C","Annual energy use","EA105",{"$f":"IF(EA!#REF!>0,\"X\",\"\")","v":{"$error":"#REF!"}},{"$f":"EA!#REF!","v":{"$error":"#REF!"}},30,"8.5 points","EA05T17",{"$f":"IF(G491=8.5,\"X\",\"\")","v":{"$error":"#REF!"}}]
["LEED v4 BD+C: Midrise","EA","C","Annual energy use","EA105",{"$f":"IF(EA!#REF!>0,\"X\",\"\")","v":{"$error":"#REF!"}},{"$f":"EA!#REF!","v":{"$error":"#REF!"}},30,"9 points","EA05T18",{"$f":"IF(G492=9,\"X\",\"\")","v":{"$error":"#REF!"}}]
["LEED v4 BD+C: Midrise","EA","C","Annual energy use","EA105",{"$f":"IF(EA!#REF!>0,\"X\",\"\")","v":{"$error":"#REF!"}},{"$f":"EA!#REF!","v":{"$error":"#REF!"}},30,"9.5 points","EA05T19",{"$f":"IF(G493=9.5,\"X\",\"\")","v":{"$error":"#REF!"}}]
["LEED v4 BD+C: Midrise","EA","C","Annual energy use","EA105",{"$f":"IF(EA!#REF!>0,\"X\",\"\")","v":{"$error":"#REF!"}},{"$f":"EA!#REF!","v":{"$error":"#REF!"}},30,"10 points","EA05T20",{"$f":"IF(G494=10,\"X\",\"\")","v":{"$error":"#REF!"}}]
["LEED v4 BD+C: Midrise","EA","C","Annual energy use","EA105",{"$f":"IF(EA!#REF!>0,\"X\",\"\")","v":{"$error":"#REF!"}},{"$f":"EA!#REF!","v":{"$error":"#REF!"}},30,"10.5 points","EA05T21",{"$f":"IF(G495=10.5,\"X\",\"\")","v":{"$error":"#REF!"}}]
["LEED v4 BD+C: Midrise","EA","C","Annual energy use","EA105",{"$f":"IF(EA!#REF!>0,\"X\",\"\")","v":{"$error":"#REF!"}},{"$f":"EA!#REF!","v":{"$error":"#REF!"}},30,"11 points","EA05T22",{"$f":"IF(G496=11,\"X\",\"\")","v":{"$error":"#REF!"}}]
["LEED v4 BD+C: Midrise","EA","C","Annual energy use","EA105",{"$f":"IF(EA!#REF!>0,\"X\",\"\")","v":{"$error":"#REF!"}},{"$f":"EA!#REF!","v":{"$error":"#REF!"}},30,"11.5 points","EA05T23",{"$f":"IF(G497=11.5,\"X\",\"\")","v":{"$error":"#REF!"}}]
["LEED v4 BD+C: Midrise","EA","C","Annual energy use","EA105",{"$f":"IF(EA!#REF!>0,\"X\",\"\")","v":{"$error":"#REF!"}},{"$f":"EA!#REF!","v":{"$error":"#REF!"}},30,"12 points","EA05T24",{"$f":"IF(G498=12,\"X\",\"\")","v":{"$error":"#REF!"}}]
["LEED v4 BD+C: Midrise","EA","C","Annual energy use","EA105",{"$f":"IF(EA!#REF!>0,\"X\",\"\")","v":{"$error":"#REF!"}},{"$f":"EA!#REF!","v":{"$error":"#REF!"}},30,"12.5 points","EA05T25",{"$f":"IF(G499=12.5,\"X\",\"\")","v":{"$error":"#REF!"}}]
["LEED v4 BD+C: Midrise","EA","C","Annual energy use","EA105",{"$f":"IF(EA!#REF!>0,\"X\",\"\")","v":{"$error":"#REF!"}},{"$f":"EA!#REF!","v":{"$error":"#REF!"}},30,"13 points","EA05T26",{"$f":"IF(G500=13,\"X\",\"\")","v":{"$error":"#REF!"}}]
["LEED v4 BD+C: Midrise","EA","C","Annual energy use","EA105",{"$f":"IF(EA!#REF!>0,\"X\",\"\")","v":{"$error":"#REF!"}},{"$f":"EA!#REF!","v":{"$error":"#REF!"}},30,"13.5 points","EA05T27",{"$f":"IF(G501=13.5,\"X\",\"\")","v":{"$error":"#REF!"}}]
["LEED v4 BD+C: Midrise","EA","C","Annual energy use","EA105",{"$f":"IF(EA!#REF!>0,\"X\",\"\")","v":{"$error":"#REF!"}},{"$f":"EA!#REF!","v":{"$error":"#REF!"}},30,"14 points","EA05T28",{"$f":"IF(G502=14,\"X\",\"\")","v":{"$error":"#REF!"}}]
["LEED v4 BD+C: Midrise","EA","C","Annual energy use","EA105",{"$f":"IF(EA!#REF!>0,\"X\",\"\")","v":{"$error":"#REF!"}},{"$f":"EA!#REF!","v":{"$error":"#REF!"}},30,"14.5 points","EA05T29",{"$f":"IF(G503=14.5,\"X\",\"\")","v":{"$error":"#REF!"}}]
["LEED v4 BD+C: Midrise","EA","C","Annual energy use","EA105",{"$f":"IF(EA!#REF!>0,\"X\",\"\")","v":{"$error":"#REF!"}},{"$f":"EA!#REF!","v":{"$error":"#REF!"}},30,"15 points","EA05T30",{"$f":"IF(G504=15,\"X\",\"\")","v":{"$error":"#REF!"}}]
["LEED v4 BD+C: Midrise","EA","C","Annual energy use","EA105",{"$f":"IF(EA!#REF!>0,\"X\",\"\")","v":{"$error":"#REF!"}},{"$f":"EA!#REF!","v":{"$error":"#REF!"}},30,"15.5 points","EA05T31",{"$f":"IF(G505=15.5,\"X\",\"\")","v":{"$error":"#REF!"}}]
["LEED v4 BD+C: Midrise","EA","C","Annual energy use","EA105",{"$f":"IF(EA!#REF!>0,\"X\",\"\")","v":{"$error":"#REF!"}},{"$f":"EA!#REF!","v":{"$error":"#REF!"}},30,"16 points","EA05T32",{"$f":"IF(G506=16,\"X\",\"\")","v":{"$error":"#REF!"}}]
["LEED v4 BD+C: Midrise","EA","C","Annual energy use","EA105",{"$f":"IF(EA!#REF!>0,\"X\",\"\")","v":{"$error":"#REF!"}},{"$f":"EA!#REF!","v":{"$error":"#REF!"}},30,"16.5 points","EA05T33",{"$f":"IF(G507=16.5,\"X\",\"\")","v":{"$error":"#REF!"}}]
["LEED v4 BD+C: Midrise","EA","C","Annual energy use","EA105",{"$f":"IF(EA!#REF!>0,\"X\",\"\")","v":{"$error":"#REF!"}},{"$f":"EA!#REF!","v":{"$error":"#REF!"}},30,"17 points","EA05T34",{"$f":"IF(G508=17,\"X\",\"\")","v":{"$error":"#REF!"}}]
["LEED v4 BD+C: Midrise","EA","C","Annual energy use","EA105",{"$f":"IF(EA!#REF!>0,\"X\",\"\")","v":{"$error":"#REF!"}},{"$f":"EA!#REF!","v":{"$error":"#REF!"}},30,"17.5 points","EA05T35",{"$f":"IF(G509=17.5,\"X\",\"\")","v":{"$error":"#REF!"}}]
["LEED v4 BD+C: Midrise","EA","C","Annual energy use","EA105",{"$f":"IF(EA!#REF!>0,\"X\",\"\")","v":{"$error":"#REF!"}},{"$f":"EA!#REF!","v":{"$error":"#REF!"}},30,"18 points","EA05T36",{"$f":"IF(G510=18,\"X\",\"\")","v":{"$error":"#REF!"}}]
["LEED v4 BD+C: Midrise","EA","C","Annual energy use","EA105",{"$f":"IF(EA!#REF!>0,\"X\",\"\")","v":{"$error":"#REF!"}},{"$f":"EA!#REF!","v":{"$error":"#REF!"}},30,"18.5 points","EA05T37",{"$f":"IF(G511=18.5,\"X\",\"\")","v":{"$error":"#REF!"}}]
["LEED v4 BD+C: Midrise","EA","C","Annual energy use","EA105",{"$f":"IF(EA!#REF!>0,\"X\",\"\")","v":{"$error":"#REF!"}},{"$f":"EA!#REF!","v":{"$error":"#REF!"}},30,"19 points","EA05T38",{"$f":"IF(G512=19,\"X\",\"\")","v":{"$error":"#REF!"}}]
["LEED v4 BD+C: Midrise","EA","C","Annual energy use","EA105",{"$f":"IF(EA!#REF!>0,\"X\",\"\")","v":{"$error":"#REF!"}},{"$f":"EA!#REF!","v":{"$error":"#REF!"}},30,"19.5 points","EA05T39",{"$f":"IF(G513=19.5,\"X\",\"\")","v":{"$error":"#REF!"}}]
["LEED v4 BD+C: Midrise","EA","C","Annual energy use","EA105",{"$f":"IF(EA!#REF!>0,\"X\",\"\")","v":{"$error":"#REF!"}},{"$f":"EA!#REF!","v":{"$error":"#REF!"}},30,"20 points","EA05T40",{"$f":"IF(G514=20,\"X\",\"\")","v":{"$error":"#REF!"}}]
["LEED v4 BD+C: Midrise","EA","C","Annual energy use","EA105",{"$f":"IF(EA!#REF!>0,\"X\",\"\")","v":{"$error":"#REF!"}},{"$f":"EA!#REF!","v":{"$error":"#REF!"}},30,"20.5 points","EA05T41",{"$f":"IF(G515=20.5,\"X\",\"\")","v":{"$error":"#REF!"}}]
["LEED v4 BD+C: Midrise","EA","C","Annual energy use","EA105",{"$f":"IF(EA!#REF!>0,\"X\",\"\")","v":{"$error":"#REF!"}},{"$f":"EA!#REF!","v":{"$error":"#REF!"}},30,"21 points","EA05T42",{"$f":"IF(G516=21,\"X\",\"\")","v":{"$error":"#REF!"}}]
["LEED v4 BD+C: Midrise","EA","C","Annual energy use","EA105",{"$f":"IF(EA!#REF!>0,\"X\",\"\")","v":{"$error":"#REF!"}},{"$f":"EA!#REF!","v":{"$error":"#REF!"}},30,"21.5 points","EA05T43",{"$f":"IF(G517=21.5,\"X\",\"\")","v":{"$error":"#REF!"}}]
["LEED v4 BD+C: Midrise","EA","C","Annual energy use","EA105",{"$f":"IF(EA!#REF!>0,\"X\",\"\")","v":{"$error":"#REF!"}},{"$f":"EA!#REF!","v":{"$error":"#REF!"}},30,"22 points","EA05T44",{"$f":"IF(G518=22,\"X\",\"\")","v":{"$error":"#REF!"}}]
["LEED v4 BD+C: Midrise","EA","C","Annual energy use","EA105",{"$f":"IF(EA!#REF!>0,\"X\",\"\")","v":{"$error":"#REF!"}},{"$f":"EA!#REF!","v":{"$error":"#REF!"}},30,"22.5 points","EA05T45",{"$f":"IF(G519=22.5,\"X\",\"\")","v":{"$error":"#REF!"}}]
["LEED v4 BD+C: Midrise","EA","C","Annual energy use","EA105",{"$f":"IF(EA!#REF!>0,\"X\",\"\")","v":{"$error":"#REF!"}},{"$f":"EA!#REF!","v":{"$error":"#REF!"}},30,"23 points","EA05T46",{"$f":"IF(G520=23,\"X\",\"\")","v":{"$error":"#REF!"}}]
["LEED v4 BD+C: Midrise","EA","C","Annual energy use","EA105",{"$f":"IF(EA!#REF!>0,\"X\",\"\")","v":{"$error":"#REF!"}},{"$f":"EA!#REF!","v":{"$error":"#REF!"}},30,"23.5 points","EA05T47",{"$f":"IF(G521=23.5,\"X\",\"\")","v":{"$error":"#REF!"}}]
["LEED v4 BD+C: Midrise","EA","C","Annual energy use","EA105",{"$f":"IF(EA!#REF!>0,\"X\",\"\")","v":{"$error":"#REF!"}},{"$f":"EA!#REF!","v":{"$error":"#REF!"}},30,"24 points","EA05T48",{"$f":"IF(G522=24,\"X\",\"\")","v":{"$error":"#REF!"}}]
["LEED v4 BD+C: Midrise","EA","C","Annual energy use","EA105",{"$f":"IF(EA!#REF!>0,\"X\",\"\")","v":{"$error":"#REF!"}},{"$f":"EA!#REF!","v":{"$error":"#REF!"}},30,"24.5 points","EA05T49",{"$f":"IF(G523=24.5,\"X\",\"\")","v":{"$error":"#REF!"}}]
["LEED v4 BD+C: Midrise","EA","C","Annual energy use","EA105",{"$f":"IF(EA!#REF!>0,\"X\",\"\")","v":{"$error":"#REF!"}},{"$f":"EA!#REF!","v":{"$error":"#REF!"}},30,"25 points","EA05T50",{"$f":"IF(G524=25,\"X\",\"\")","v":{"$error":"#REF!"}}]
["LEED v4 BD+C: Midrise","EA","C","Annual energy use","EA105",{"$f":"IF(EA!#REF!>0,\"X\",\"\")","v":{"$error":"#REF!"}},{"$f":"EA!#REF!","v":{"$error":"#REF!"}},30,"25.5 points","EA05T51",{"$f":"IF(G525=25.5,\"X\",\"\")","v":{"$error":"#REF!"}}]
["LEED v4 BD+C: Midrise","EA","C","Annual energy use","EA105",{"$f":"IF(EA!#REF!>0,\"X\",\"\")","v":{"$error":"#REF!"}},{"$f":"EA!#REF!","v":{"$error":"#REF!"}},30,"26 points","EA05T52",{"$f":"IF(G526=26,\"X\",\"\")","v":{"$error":"#REF!"}}]
["LEED v4 BD+C: Midrise","EA","C","Annual energy use","EA105",{"$f":"IF(EA!#REF!>0,\"X\",\"\")","v":{"$error":"#REF!"}},{"$f":"EA!#REF!","v":{"$error":"#REF!"}},30,"26.5 points","EA05T53",{"$f":"IF(G527=26.5,\"X\",\"\")","v":{"$error":"#REF!"}}]
["LEED v4 BD+C: Midrise","EA","C","Annual energy use","EA105",{"$f":"IF(EA!#REF!>0,\"X\",\"\")","v":{"$error":"#REF!"}},{"$f":"EA!#REF!","v":{"$error":"#REF!"}},30,"27 points","EA05T54",{"$f":"IF(G528=27,\"X\",\"\")","v":{"$error":"#REF!"}}]
["LEED v4 BD+C: Midrise","EA","C","Annual energy use","EA105",{"$f":"IF(EA!#REF!>0,\"X\",\"\")","v":{"$error":"#REF!"}},{"$f":"EA!#REF!","v":{"$error":"#REF!"}},30,"27.5 points","EA05T55",{"$f":"IF(G529=27.5,\"X\",\"\")","v":{"$error":"#REF!"}}]
["LEED v4 BD+C: Midrise","EA","C","Annual energy use","EA105",{"$f":"IF(EA!#REF!>0,\"X\",\"\")","v":{"$error":"#REF!"}},{"$f":"EA!#REF!","v":{"$error":"#REF!"}},30,"28 points","EA05T56",{"$f":"IF(G530=28,\"X\",\"\")","v":{"$error":"#REF!"}}]
["LEED v4 BD+C: Midrise","EA","C","Annual energy use","EA105",{"$f":"IF(EA!#REF!>0,\"X\",\"\")","v":{"$error":"#REF!"}},{"$f":"EA!#REF!","v":{"$error":"#REF!"}},30,"28.5 points","EA05T57",{"$f":"IF(G531=28.5,\"X\",\"\")","v":{"$error":"#REF!"}}]
["LEED v4 BD+C: Midrise","EA","C","Annual energy use","EA105",{"$f":"IF(EA!#REF!>0,\"X\",\"\")","v":{"$error":"#REF!"}},{"$f":"EA!#REF!","v":{"$error":"#REF!"}},30,"29 points","EA05T58",{"$f":"IF(G532=29,\"X\",\"\")","v":{"$error":"#REF!"}}]
["LEED v4 BD+C: Midrise","EA","C","Annual energy use","EA105",{"$f":"IF(EA!#REF!>0,\"X\",\"\")","v":{"$error":"#REF!"}},{"$f":"EA!#REF!","v":{"$error":"#REF!"}},30,"29.5 points","EA05T59",{"$f":"IF(G533=29.5,\"X\",\"\")","v":{"$error":"#REF!"}}]
["LEED v4 BD+C: Midrise","EA","C","Annual energy use","EA105",{"$f":"IF(EA!#REF!>0,\"X\",\"\")","v":{"$error":"#REF!"}},{"$f":"EA!#REF!","v":{"$error":"#REF!"}},30,"30 points","EA05T60",{"$f":"IF(G534>=30,\"X\",\"\")","v":{"$error":"#REF!"}}]
["LEED v4 BD+C: Midrise","EA","C","Efficient hot water distribution system","EA106",{"$f":"IF(EA!$J$86>0,\"X\",\"\")","v":""},{"$f":"EA!$J$86","v":0},5,null,null,null,"Option 1","EA06O1",{"$f":"IF(EA!$J$89>0,\"X\",\"\")","v":""}]
["LEED v4 BD+C: Midrise","EA","C","Efficient hot water distribution system","EA106",{"$f":"IF(EA!$J$86>0,\"X\",\"\")","v":""},{"$f":"EA!$J$86","v":0},5,null,null,null,"Option 1","EA06O1",{"$f":"IF(EA!$J$89>0,\"X\",\"\")","v":""},"Path 1","EA06O1P1",{"$f":"IF(EA!$J$107>0,\"X\",\"\")","v":""}]
["LEED v4 BD+C: Midrise","EA","C","Efficient hot water distribution system","EA106",{"$f":"IF(EA!$J$86>0,\"X\",\"\")","v":""},{"$f":"EA!$J$86","v":0},5,null,null,null,"Option 1","EA06O1",{"$f":"IF(EA!$J$89>0,\"X\",\"\")","v":""},"Path 2","EA06O1P2",{"$f":"IF(EA!$J$117>0,\"X\",\"\")","v":""}]
["LEED v4 BD+C: Midrise","EA","C","Efficient hot water distribution system","EA106",{"$f":"IF(EA!$J$86>0,\"X\",\"\")","v":""},{"$f":"EA!$J$86","v":0},5,null,null,null,"Option 2","EA06O2",{"$f":"IF(EA!$J$123>0,\"X\",\"\")","v":""}]
["LEED v4 BD+C: Midrise","EA","C","Efficient hot water distribution system","EA106",{"$f":"IF(EA!$J$86>0,\"X\",\"\")","v":""},{"$f":"EA!$J$86","v":0},5,null,null,null,"Option 2","EA06O2",{"$f":"IF(EA!$J$123>0,\"X\",\"\")","v":""},"Case 1","EA06O2P1",{"$f":"IF(EA!$J$142>0,\"X\",\"\")","v":""}]
["LEED v4 BD+C: Midrise","EA","C","Efficient hot water distribution system","EA106",{"$f":"IF(EA!$J$86>0,\"X\",\"\")","v":""},{"$f":"EA!$J$86","v":0},5,null,null,null,"Option 2","EA06O2",{"$f":"IF(EA!$J$123>0,\"X\",\"\")","v":""},"Case 2","EA06O2P2",{"$f":"IF(EA!$J$150>0,\"X\",\"\")","v":""}]
["LEED v4 BD+C: Midrise","EA","C","Efficient hot water distribution system","EA106",{"$f":"IF(EA!$J$86>0,\"X\",\"\")","v":""},{"$f":"EA!$J$86","v":0},5,null,null,null,"Option 3","EA06O3",{"$f":"IF(EA!$J$159>0,\"X\",\"\")","v":""}]
["LEED v4 BD+C: Midrise","EA","C","Advanced utility tracking","EA108",{"$f":"IF(EA!#REF!>0,\"X\",\"\")","v":{"$error":"#REF!"}},{"$f":"EA!#REF!","v":{"$error":"#REF!"}},2,null,null,null,"Case 1, Option 1","EA08O1",{"$f":"IF(EA!#REF!>0,\"X\",\"\")","v":{"$error":"#REF!"}}]
["LEED v4 BD+C: Midrise","EA","C","Advanced utility tracking","EA108",{"$f":"IF(EA!#REF!>0,\"X\",\"\")","v":{"$error":"#REF!"}},{"$f":"EA!#REF!","v":{"$error":"#REF!"}},2,null,null,null,"Case 1, Option 2","EA08O2",{"$f":"IF(EA!#REF!>0,\"X\",\"\")","v":{"$error":"#REF!"}}]
["LEED v4 BD+C: Midrise","EA","C","Advanced utility tracking","EA108",{"$f":"IF(EA!#REF!>0,\"X\",\"\")","v":{"$error":"#REF!"}},{"$f":"EA!#REF!","v":{"$error":"#REF!"}},2,null,null,null,"Case 2, Option 1","EA08O3",{"$f":"IF(EA!#REF!>0,\"X\",\"\")","v":{"$error":"#REF!"}}]
["LEED v4 BD+C: Midrise","EA","C","Advanced utility tracking","EA108",{"$f":"IF(EA!#REF!>0,\"X\",\"\")","v":{"$error":"#REF!"}},{"$f":"EA!#REF!","v":{"$error":"#REF!"}},2,null,null,null,"Case 2, Option 2","EA08O4",{"$f":"IF(EA!#REF!>0,\"X\",\"\")","v":{"$error":"#REF!"}}]
["LEED v4 BD+C: Midrise","EA","C","Advanced utility tracking","EA108",{"$f":"IF(EA!#REF!>0,\"X\",\"\")","v":{"$error":"#REF!"}},{"$f":"EA!#REF!","v":{"$error":"#REF!"}},2,null,null,null,"Case 2, Option 2","EA08O4",{"$f":"IF(EA!#REF!>0,\"X\",\"\")","v":{"$error":"#REF!"}},"Path 1","EA08O4P1",{"$f":"IF(EA!#REF!>0,\"X\",\"\")","v":{"$error":"#REF!"}}]
["LEED v4 BD+C: Midrise","EA","C","Advanced utility tracking","EA108",{"$f":"IF(EA!#REF!>0,\"X\",\"\")","v":{"$error":"#REF!"}},{"$f":"EA!#REF!","v":{"$error":"#REF!"}},2,null,null,null,"Case 2, Option 2","EA08O4",{"$f":"IF(EA!#REF!>0,\"X\",\"\")","v":{"$error":"#REF!"}},"Path 2","EA08O4P2",{"$f":"IF(EA!#REF!>0,\"X\",\"\")","v":{"$error":"#REF!"}}]
["LEED v4 BD+C: Midrise","MR","P","Certified tropical wood","MR101","x",{"$f":"MR!$J$7","v":"N"},0]
["LEED v4 BD+C: Midrise","MR","P","Durability management","MR102","x",{"$f":"MR!$J$14","v":"N"},0]
["LEED v4 BD+C: Midrise","MR","C","Durability management verification","MR103",{"$f":"IF(MR!$J$39>0,\"X\",\"\")","v":""},{"$f":"MR!$J$39","v":0},1]
["LEED v4 BD+C: Midrise","MR","C","Environmentally preferable products","MR104",{"$f":"IF(MR!$J$66>0,\"X\",\"\")","v":""},{"$f":"MR!$J$66","v":0},5,null,null,null,"Option 1","MR04O1",{"$f":"IF(MR!$J$70>0,\"X\",\"\")","v":""}]
["LEED v4 BD+C: Midrise","MR","C","Environmentally preferable products","MR104",{"$f":"IF(MR!$J$66>0,\"X\",\"\")","v":""},{"$f":"MR!$J$66","v":0},5,null,null,null,"Option 1","MR04O1",{"$f":"IF(MR!$J$70>0,\"X\",\"\")","v":""},"0.5 points","MR04O1P1",{"$f":"IF(MR!$J$70=0.5,\"X\",\"\")","v":""}]
["LEED v4 BD+C: Midrise","MR","C","Environmentally preferable products","MR104",{"$f":"IF(MR!$J$66>0,\"X\",\"\")","v":""},{"$f":"MR!$J$66","v":0},5,null,null,null,"Option 1","MR04O1",{"$f":"IF(MR!$J$70>0,\"X\",\"\")","v":""},"1 point","MR04O1P2",{"$f":"IF(MR!$J$70=1,\"X\",\"\")","v":""}]
["LEED v4 BD+C: Midrise","MR","C","Environmentally preferable products","MR104",{"$f":"IF(MR!$J$66>0,\"X\",\"\")","v":""},{"$f":"MR!$J$66","v":0},5,null,null,null,"Option 1","MR04O1",{"$f":"IF(MR!$J$70>0,\"X\",\"\")","v":""},"1.5 points","MR04O1P3",{"$f":"IF(MR!$J$70=1.5,\"X\",\"\")","v":""}]
["LEED v4 BD+C: Midrise","MR","C","Environmentally preferable products","MR104",{"$f":"IF(MR!$J$66>0,\"X\",\"\")","v":""},{"$f":"MR!$J$66","v":0},5,null,null,null,"Option 2","MR04O2",{"$f":"IF(MR!$J$79>0,\"X\",\"\")","v":""}]
["LEED v4 BD+C: Midrise","MR","C","Environmentally preferable products","MR104",{"$f":"IF(MR!$J$66>0,\"X\",\"\")","v":""},{"$f":"MR!$J$66","v":0},5,null,null,null,"Option 2","MR04O2",{"$f":"IF(MR!$J$79>0,\"X\",\"\")","v":""},"0.5 points","MR04O2P1",{"$f":"IF(MR!$J$79=0.5,\"X\",\"\")","v":""}]
["LEED v4 BD+C: Midrise","MR","C","Environmentally preferable products","MR104",{"$f":"IF(MR!$J$66>0,\"X\",\"\")","v":""},{"$f":"MR!$J$66","v":0},5,null,null,null,"Option 2","MR04O2",{"$f":"IF(MR!$J$79>0,\"X\",\"\")","v":""},"1 point","MR04O2P2",{"$f":"IF(MR!$J$79=1,\"X\",\"\")","v":""}]
["LEED v4 BD+C: Midrise","MR","C","Environmentally preferable products","MR104",{"$f":"IF(MR!$J$66>0,\"X\",\"\")","v":""},{"$f":"MR!$J$66","v":0},5,null,null,null,"Option 2","MR04O2",{"$f":"IF(MR!$J$79>0,\"X\",\"\")","v":""},"1.5 points","MR04O2P3",{"$f":"IF(MR!$J$79=1.5,\"X\",\"\")","v":""}]
["LEED v4 BD+C: Midrise","MR","C","Environmentally preferable products","MR104",{"$f":"IF(MR!$J$66>0,\"X\",\"\")","v":""},{"$f":"MR!$J$66","v":0},5,null,null,null,"Option 2","MR04O2",{"$f":"IF(MR!$J$79>0,\"X\",\"\")","v":""},"2 points","MR04O2P4",{"$f":"IF(MR!$J$79=2,\"X\",\"\")","v":""}]
["LEED v4 BD+C: Midrise","MR","C","Environmentally preferable products","MR104",{"$f":"IF(MR!$J$66>0,\"X\",\"\")","v":""},{"$f":"MR!$J$66","v":0},5,null,null,null,"Option 2","MR04O2",{"$f":"IF(MR!$J$79>0,\"X\",\"\")","v":""},"2.5 points","MR04O2P5",{"$f":"IF(MR!$J$79=2.5,\"X\",\"\")","v":""}]
["LEED v4 BD+C: Midrise","MR","C","Environmentally preferable products","MR104",{"$f":"IF(MR!$J$66>0,\"X\",\"\")","v":""},{"$f":"MR!$J$66","v":0},5,null,null,null,"Option 2","MR04O2",{"$f":"IF(MR!$J$79>0,\"X\",\"\")","v":""},"3 points","MR04O2P6",{"$f":"IF(MR!$J$79=3,\"X\",\"\")","v":""}]
["LEED v4 BD+C: Midrise","MR","C","Environmentally preferable products","MR104",{"$f":"IF(MR!$J$66>0,\"X\",\"\")","v":""},{"$f":"MR!$J$66","v":0},5,null,null,null,"Option 2","MR04O2",{"$f":"IF(MR!$J$79>0,\"X\",\"\")","v":""},"3.5 points","MR04O2P7",{"$f":"IF(MR!$J$79=3.5,\"X\",\"\")","v":""}]
["LEED v4 BD+C: Midrise","MR","C","Environmentally preferable products","MR104",{"$f":"IF(MR!$J$66>0,\"X\",\"\")","v":""},{"$f":"MR!$J$66","v":0},5,null,null,null,"Option 2","MR04O2",{"$f":"IF(MR!$J$79>0,\"X\",\"\")","v":""},"4 points","MR04O2P8",{"$f":"IF(MR!$J$79=4,\"X\",\"\")","v":""}]
["LEED v4 BD+C: Midrise","MR","C","Environmentally preferable products","MR104",{"$f":"IF(MR!$J$66>0,\"X\",\"\")","v":""},{"$f":"MR!$J$66","v":0},5,null,null,null,"Option 2","MR04O2",{"$f":"IF(MR!$J$79>0,\"X\",\"\")","v":""},"4.5 points","MR04O2P9",{"$f":"IF(MR!$J$79=4.5,\"X\",\"\")","v":""}]
["LEED v4 BD+C: Midrise","MR","C","Environmentally preferable products","MR104",{"$f":"IF(MR!$J$66>0,\"X\",\"\")","v":""},{"$f":"MR!$J$66","v":0},5,null,null,null,"Option 2","MR04O2",{"$f":"IF(MR!$J$79>0,\"X\",\"\")","v":""},"5 points","MR04O2P10",{"$f":"IF(MR!$J$79=5,\"X\",\"\")","v":""}]
["LEED v4 BD+C: Midrise","MR","C","Construction waste management","MR105",{"$f":"IF(MR!$J$118>0,\"X\",\"\")","v":""},{"$f":"MR!$J$118","v":0},3,"0.5 points","MR05T1",{"$f":"IF(G566=0.5,\"X\",\"\")","v":""}]
["LEED v4 BD+C: Midrise","MR","C","Construction waste management","MR105",{"$f":"IF(MR!$J$118>0,\"X\",\"\")","v":""},{"$f":"MR!$J$118","v":0},3,"1 point","MR05T2",{"$f":"IF(G567=1,\"X\",\"\")","v":""}]
["LEED v4 BD+C: Midrise","MR","C","Construction waste management","MR105",{"$f":"IF(MR!$J$118>0,\"X\",\"\")","v":""},{"$f":"MR!$J$118","v":0},3,"1.5 points","MR05T3",{"$f":"IF(G568=1.5,\"X\",\"\")","v":""}]
["LEED v4 BD+C: Midrise","MR","C","Construction waste management","MR105",{"$f":"IF(MR!$J$118>0,\"X\",\"\")","v":""},{"$f":"MR!$J$118","v":0},3,"2 points","MR05T4",{"$f":"IF(G569=2,\"X\",\"\")","v":""}]
["LEED v4 BD+C: Midrise","MR","C","Construction waste management","MR105",{"$f":"IF(MR!$J$118>0,\"X\",\"\")","v":""},{"$f":"MR!$J$118","v":0},3,"2.5 points","MR05T5",{"$f":"IF(G570=2.5,\"X\",\"\")","v":""}]
["LEED v4 BD+C: Midrise","MR","C","Construction waste management","MR105",{"$f":"IF(MR!$J$118>0,\"X\",\"\")","v":""},{"$f":"MR!$J$118","v":0},3,"3 points","MR05T6",{"$f":"IF(G571=3,\"X\",\"\")","v":""}]
["LEED v4 BD+C: Midrise","EQ","P","Ventilation","EQ101","x",{"$f":"EQ!$J$7","v":"N"},0,null,null,null,"Case 1","EQ01O1",{"$f":"IF(EQ!$J$10=\"Y\",\"X\",\"\")","v":""}]
["LEED v4 BD+C: Midrise","EQ","P","Ventilation","EQ101","x",{"$f":"EQ!$J$7","v":"N"},0,null,null,null,"Case 2","EQ01O2",{"$f":"IF(EQ!#REF!=\"Y\",\"X\",\"\")","v":{"$error":"#REF!"}}]
["LEED v4 BD+C: Midrise","EQ","P","Combustion venting","EQ102","x",{"$f":"EQ!$J$32","v":"N"},0]
["LEED v4 BD+C: Midrise","EQ","P","Garage pollutant protection","EQ103","x",{"$f":"EQ!$J$53","v":"N"},0]
["LEED v4 BD+C: Midrise","EQ","P","Radon-resistant construction","EQ104","x",{"$f":"EQ!$J$73","v":"N"},0,null,null,null,"EPA label","EQ04O1",{"$f":"IF(EQ!$J$77=\"Y\",\"X\",\"\")","v":""}]
["LEED v4 BD+C: Midrise","EQ","P","Radon-resistant construction","EQ104","x",{"$f":"EQ!$J$73","v":"N"},0,null,null,null,"Case 1","EQ04O2",{"$f":"IF(EQ!$J$83=\"Y\",\"X\",\"\")","v":""}]
["LEED v4 BD+C: Midrise","EQ","P","Radon-resistant construction","EQ104","x",{"$f":"EQ!$J$73","v":"N"},0,null,null,null,"Case 2","EQ04O3",{"$f":"IF(EQ!$J$97=\"Y\",\"X\",\"\")","v":""}]
["LEED v4 BD+C: Midrise","EQ","P","Air filtering","EQ105","x",{"$f":"EQ!$J$109","v":"N"},0]
["LEED v4 BD+C: Midrise","EQ","P","Environmental tobacco smoke","EQ106","x",{"$f":"EQ!#REF!","v":{"$error":"#REF!"}},0]
["LEED v4 BD+C: Midrise","EQ","P","Compartmentalization","EQ107","x",{"$f":"EQ!$J$119","v":"N"},0]
["LEED v4 BD+C: Midrise","EQ","C","Enhanced ventilation","EQ108",{"$f":"IF(EQ!$J$135>0,\"X\",\"\")","v":""},{"$f":"EQ!$J$135","v":0},3,null,null,null,"Option 1","EQ08O1",{"$f":"IF(EQ!$J$139>0,\"X\",\"\")","v":""}]
["LEED v4 BD+C: Midrise","EQ","C","Enhanced ventilation","EQ108",{"$f":"IF(EQ!$J$135>0,\"X\",\"\")","v":""},{"$f":"EQ!$J$135","v":0},3,null,null,null,"Option 2","EQ08O2",{"$f":"IF(EQ!$J$145>0,\"X\",\"\")","v":""}]
["LEED v4 BD+C: Midrise","EQ","C","Contaminant control","EQ109",{"$f":"IF(EQ!$J$160>0,\"X\",\"\")","v":""},{"$f":"EQ!$J$160","v":0},2,null,null,null,"Option 1","EQ09O1",{"$f":"IF(EQ!$J$164>0,\"X\",\"\")","v":""}]
["LEED v4 BD+C: Midrise","EQ","C","Contaminant control","EQ109",{"$f":"IF(EQ!$J$160>0,\"X\",\"\")","v":""},{"$f":"EQ!$J$160","v":0},2,null,null,null,"Option 2","EQ09O2",{"$f":"IF(EQ!$J$173>0,\"X\",\"\")","v":""}]
["LEED v4 BD+C: Midrise","EQ","C","Contaminant control","EQ109",{"$f":"IF(EQ!$J$160>0,\"X\",\"\")","v":""},{"$f":"EQ!$J$160","v":0},2,null,null,null,"Option 3","EQ09O3",{"$f":"IF(EQ!$J$181>0,\"X\",\"\")","v":""}]
["LEED v4 BD+C: Midrise","EQ","C","Contaminant control","EQ109",{"$f":"IF(EQ!$J$160>0,\"X\",\"\")","v":""},{"$f":"EQ!$J$160","v":0},2,null,null,null,"Option 4","EQ09O4",{"$f":"IF(EQ!$J$194>0,\"X\",\"\")","v":""}]
["LEED v4 BD+C: Midrise","EQ","C","Balancing of heating and cooling distribution systems","EQ110",{"$f":"IF(EQ!$J$256>0,\"X\",\"\")","v":""},{"$f":"EQ!$J$256","v":0},3,null,null,null,"Case 1","EQ10O1",{"$f":"IF(EQ!$J$260>0,\"X\",\"\")","v":""}]
["LEED v4 BD+C: Midrise","EQ","C","Balancing of heating and cooling distribution systems","EQ110",{"$f":"IF(EQ!$J$256>0,\"X\",\"\")","v":""},{"$f":"EQ!$J$256","v":0},3,null,null,null,"Case 1","EQ10O1",{"$f":"IF(EQ!$J$260>0,\"X\",\"\")","v":""},"Option 1","EQ10O1P1",{"$f":"IF(EQ!$J$263>0,\"X\",\"\")","v":""}]
["LEED v4 BD+C: Midrise","EQ","C","Balancing of heating and cooling distribution systems","EQ110",{"$f":"IF(EQ!$J$256>0,\"X\",\"\")","v":""},{"$f":"EQ!$J$256","v":0},3,null,null,null,"Case 1","EQ10O1",{"$f":"IF(EQ!$J$260>0,\"X\",\"\")","v":""},"Option 2","EQ10O1P2",{"$f":"IF(EQ!$J$272>0,\"X\",\"\")","v":""}]
["LEED v4 BD+C: Midrise","EQ","C","Balancing of heating and cooling distribution systems","EQ110",{"$f":"IF(EQ!$J$256>0,\"X\",\"\")","v":""},{"$f":"EQ!$J$256","v":0},3,null,null,null,"Case 1","EQ10O1",{"$f":"IF(EQ!$J$260>0,\"X\",\"\")","v":""},"Option 3","EQ10O1P3",{"$f":"IF(EQ!$J$284>0,\"X\",\"\")","v":""}]
["LEED v4 BD+C: Midrise","EQ","C","Balancing of heating and cooling distribution systems","EQ110",{"$f":"IF(EQ!$J$256>0,\"X\",\"\")","v":""},{"$f":"EQ!$J$256","v":0},3,null,null,null,"Case 2","EQ10O2",{"$f":"IF(EQ!#REF!>0,\"X\",\"\")","v":{"$error":"#REF!"}}]
["LEED v4 BD+C: Midrise","EQ","C","Balancing of heating and cooling distribution systems","EQ110",{"$f":"IF(EQ!$J$256>0,\"X\",\"\")","v":""},{"$f":"EQ!$J$256","v":0},3,null,null,null,"Case 2","EQ10O2",{"$f":"IF(EQ!#REF!>0,\"X\",\"\")","v":{"$error":"#REF!"}},"Option 1","EQ10O2P1",{"$f":"IF(EQ!#REF!>0,\"X\",\"\")","v":{"$error":"#REF!"}}]
["LEED v4 BD+C: Midrise","EQ","C","Balancing of heating and cooling distribution systems","EQ110",{"$f":"IF(EQ!$J$256>0,\"X\",\"\")","v":""},{"$f":"EQ!$J$256","v":0},3,null,null,null,"Case 2","EQ10O2",{"$f":"IF(EQ!#REF!>0,\"X\",\"\")","v":{"$error":"#REF!"}},"Option 2","EQ10O2P2",{"$f":"IF(EQ!#REF!>0,\"X\",\"\")","v":{"$error":"#REF!"}}]
["LEED v4 BD+C: Midrise","EQ","C","Enhanced compartmentalization","EQ111",{"$f":"IF(EQ!#REF!>0,\"X\",\"\")","v":{"$error":"#REF!"}},{"$f":"EQ!#REF!","v":{"$error":"#REF!"}},3,"1 point","EQ11T1",{"$f":"IF(G595=1,\"X\",\"\")","v":{"$error":"#REF!"}}]
["LEED v4 BD+C: Midrise","EQ","C","Enhanced compartmentalization","EQ111",{"$f":"IF(EQ!#REF!>0,\"X\",\"\")","v":{"$error":"#REF!"}},{"$f":"EQ!#REF!","v":{"$error":"#REF!"}},3,"2 points","EQ11T2",{"$f":"IF(G596=2,\"X\",\"\")","v":{"$error":"#REF!"}}]
["LEED v4 BD+C: Midrise","EQ","C","Enhanced compartmentalization","EQ111",{"$f":"IF(EQ!#REF!>0,\"X\",\"\")","v":{"$error":"#REF!"}},{"$f":"EQ!#REF!","v":{"$error":"#REF!"}},3,"3 points","EQ11T3",{"$f":"IF(G597=3,\"X\",\"\")","v":{"$error":"#REF!"}}]
["LEED v4 BD+C: Midrise","EQ","C","Enhanced combustion venting","EQ112",{"$f":"IF(EQ!#REF!>0,\"X\",\"\")","v":{"$error":"#REF!"}},{"$f":"EQ!#REF!","v":{"$error":"#REF!"}},2,null,null,null,"Option 1","EQ12O1",{"$f":"IF(EQ!#REF!>0,\"X\",\"\")","v":{"$error":"#REF!"}}]
["LEED v4 BD+C: Midrise","EQ","C","Enhanced combustion venting","EQ112",{"$f":"IF(EQ!#REF!>0,\"X\",\"\")","v":{"$error":"#REF!"}},{"$f":"EQ!#REF!","v":{"$error":"#REF!"}},2,null,null,null,"Option 2","EQ12O2",{"$f":"IF(EQ!#REF!>0,\"X\",\"\")","v":{"$error":"#REF!"}}]
["LEED v4 BD+C: Midrise","EQ","C","Enhanced garage pollutant protection","EQ113",{"$f":"IF(EQ!#REF!>0,\"X\",\"\")","v":{"$error":"#REF!"}},{"$f":"EQ!#REF!","v":{"$error":"#REF!"}},1,null,null,null,"Option 1","EQ13O1",{"$f":"IF(EQ!#REF!>0,\"X\",\"\")","v":{"$error":"#REF!"}}]
["LEED v4 BD+C: Midrise","EQ","C","Enhanced garage pollutant protection","EQ113",{"$f":"IF(EQ!#REF!>0,\"X\",\"\")","v":{"$error":"#REF!"}},{"$f":"EQ!#REF!","v":{"$error":"#REF!"}},1,null,null,null,"Option 2","EQ13O2",{"$f":"IF(EQ!#REF!>0,\"X\",\"\")","v":{"$error":"#REF!"}}]
["LEED v4 BD+C: Midrise","EQ","C","Low-emitting products","EQ114",{"$f":"IF(EQ!$J$337>0,\"X\",\"\")","v":""},{"$f":"EQ!$J$337","v":0},3,"0.5 points","EQ14T1",{"$f":"IF(G602=0.5,\"X\",\"\")","v":""}]
["LEED v4 BD+C: Midrise","EQ","C","Low-emitting products","EQ114",{"$f":"IF(EQ!$J$337>0,\"X\",\"\")","v":""},{"$f":"EQ!$J$337","v":0},3,"1 point","EQ14T2",{"$f":"IF(G603=1,\"X\",\"\")","v":""}]
["LEED v4 BD+C: Midrise","EQ","C","Low-emitting products","EQ114",{"$f":"IF(EQ!$J$337>0,\"X\",\"\")","v":""},{"$f":"EQ!$J$337","v":0},3,"1.5 points","EQ14T3",{"$f":"IF(G604=1.5,\"X\",\"\")","v":""}]
["LEED v4 BD+C: Midrise","EQ","C","Low-emitting products","EQ114",{"$f":"IF(EQ!$J$337>0,\"X\",\"\")","v":""},{"$f":"EQ!$J$337","v":0},3,"2 points","EQ14T4",{"$f":"IF(G605=2,\"X\",\"\")","v":""}]
["LEED v4 BD+C: Midrise","EQ","C","Low-emitting products","EQ114",{"$f":"IF(EQ!$J$337>0,\"X\",\"\")","v":""},{"$f":"EQ!$J$337","v":0},3,"2.5 points","EQ14T5",{"$f":"IF(G606=2.5,\"X\",\"\")","v":""}]
["LEED v4 BD+C: Midrise","EQ","C","Low-emitting products","EQ114",{"$f":"IF(EQ!$J$337>0,\"X\",\"\")","v":""},{"$f":"EQ!$J$337","v":0},3,"3 points","EQ14T6",{"$f":"IF(G607=3,\"X\",\"\")","v":""}]
["LEED v4 BD+C: Midrise","EQ","C","No environmental tobacco smoke","EQ115",{"$f":"IF(EQ!#REF!>0,\"X\",\"\")","v":{"$error":"#REF!"}},{"$f":"EQ!#REF!","v":{"$error":"#REF!"}},1]
["LEED v4 BD+C: Midrise","IN","P","Preliminary rating","IN101","x",{"$f":"IN!$J$7","v":"N"},0]
["LEED v4 BD+C: Midrise","IN","C","Innovation","IN102",{"$f":"IF(IN!$J$15>0,\"X\",\"\")","v":""},{"$f":"IN!$J$15","v":0},5,null,null,null,"Option 1","IN02O1",{"$f":"IF(IN!$J$18>0,\"X\",\"\")","v":""}]
["LEED v4 BD+C: Midrise","IN","C","Innovation","IN102",{"$f":"IF(IN!$J$15>0,\"X\",\"\")","v":""},{"$f":"IN!$J$15","v":0},5,null,null,null,"Option 2","IN02O2",{"$f":"IF(IN!$J$25>0,\"X\",\"\")","v":""}]
["LEED v4 BD+C: Midrise","IN","C","Innovation","IN102",{"$f":"IF(IN!$J$15>0,\"X\",\"\")","v":""},{"$f":"IN!$J$15","v":0},5,null,null,null,"Option 3","IN02O3",{"$f":"IF(IN!$J$31>0,\"X\",\"\")","v":""}]
["LEED v4 BD+C: Midrise","IN","C","Innovation","IN102",{"$f":"IF(IN!$J$15>0,\"X\",\"\")","v":""},{"$f":"IN!$J$15","v":0},5,null,null,null,"Option 3","IN02O3",{"$f":"IF(IN!$J$31>0,\"X\",\"\")","v":""},"0.5 points","IN02O3P1",{"$f":"IF(IN!$J$31=0.5,\"X\",\"\")","v":""}]
["LEED v4 BD+C: Midrise","IN","C","Innovation","IN102",{"$f":"IF(IN!$J$15>0,\"X\",\"\")","v":""},{"$f":"IN!$J$15","v":0},5,null,null,null,"Option 3","IN02O3",{"$f":"IF(IN!$J$31>0,\"X\",\"\")","v":""},"1 point","IN02O3P2",{"$f":"IF(IN!$J$31=1,\"X\",\"\")","v":""}]
["LEED v4 BD+C: Midrise","IN","C","Innovation","IN102",{"$f":"IF(IN!$J$15>0,\"X\",\"\")","v":""},{"$f":"IN!$J$15","v":0},5,null,null,null,"Option 3","IN02O3",{"$f":"IF(IN!$J$31>0,\"X\",\"\")","v":""},"1.5 points","IN02O3P3",{"$f":"IF(IN!$J$31=1.5,\"X\",\"\")","v":""}]
["LEED v4 BD+C: Midrise","IN","C","Innovation","IN102",{"$f":"IF(IN!$J$15>0,\"X\",\"\")","v":""},{"$f":"IN!$J$15","v":0},5,null,null,null,"Option 3","IN02O3",{"$f":"IF(IN!$J$31>0,\"X\",\"\")","v":""},"2 points","IN02O3P4",{"$f":"IF(IN!$J$31=2,\"X\",\"\")","v":""}]
["LEED v4 BD+C: Midrise","IN","C","Innovation","IN102",{"$f":"IF(IN!$J$15>0,\"X\",\"\")","v":""},{"$f":"IN!$J$15","v":0},5,null,null,null,"Option 3","IN02O3",{"$f":"IF(IN!$J$31>0,\"X\",\"\")","v":""},"2.5 points","IN02O3P5",{"$f":"IF(IN!$J$31=2.5,\"X\",\"\")","v":""}]
["LEED v4 BD+C: Midrise","IN","C","Innovation","IN102",{"$f":"IF(IN!$J$15>0,\"X\",\"\")","v":""},{"$f":"IN!$J$15","v":0},5,null,null,null,"Option 3","IN02O3",{"$f":"IF(IN!$J$31>0,\"X\",\"\")","v":""},"3 points","IN02O3P6",{"$f":"IF(IN!$J$31=3,\"X\",\"\")","v":""}]
["LEED v4 BD+C: Midrise","IN","C","LEED Accredited Professional","IN103",{"$f":"IF(IN!$J$49>0,\"X\",\"\")","v":""},{"$f":"IN!$J$49","v":0},1]