{"text_format":"1","workbook":"xlsx","n_sheets":21,"sheets":["Instructions","Scorecard (Homes)","Scorecard (Midrise)","Batch - Multifamily","Multifamily HSA","Batch - Single Family","IP","LT","SS","WE","EA","EA Lowrise","EA Midrise","MR","EQ","IN","RP","Water Reduction Calculator","Sampling Reporting Form","MRc Construction Waste Mgmt","Scorecard Data"],"not_rendered":{"charts":0,"images":10,"macros":1,"external_links":4,"defined_names":733,"comments":13,"pivot_tables":0},"unopened":[],"bounds":{"document_bytes":16777216,"sheet_cells":100000,"rows_first":2000,"rows_last":500,"rows_between":2000,"halvings":0,"cell_chars":16384,"cell_head_chars":4096},"cells_cut":0,"cells_raw":0,"read":"whole","date_system":"1900"}

{"sheet":"Instructions","index":0,"n_rows":179,"n_cols":25,"rows_kept":179,"cut":false,"hidden":false,"merged":[[119,8,119,10],[2,4,2,5],[73,4,73,5],[117,8,117,10],[118,8,118,10],[112,8,112,10],[113,8,113,10],[114,8,114,10],[115,8,115,10],[116,8,116,10],[77,2,77,5],[78,2,78,5]]}
[]
[]
[null,null,null,null,"LEED v4.1 Residential: Single Family"]
[null,null,null,null,"Step 1."]
[null,null,null,null,"Ensure this project is registered in LEED Online."]
[]
[null,null,null,null,"Step 2."]
[null,null,null,null,"Enable macros"]
{"$rows_left_out":172}
{"sheet":"Scorecard (Homes)","index":1,"n_rows":104,"n_cols":12,"rows_kept":104,"cut":false,"hidden":false,"merged":[[103,1,103,9],[15,11,16,11],[35,11,36,11],[46,11,47,11]]}
[]
[null,"LEED v4.1 Residential: Single Family"]
[null,{"$f":"CONCATENATE(IF(Type=\"Batch\",Instructions!F71,Instructions!F57),\" Scorecard\",\" (ID: \",IF(Type=\"Batch\",Instructions!F70,Instructions!F56),\")\")","v":" Scorecard (ID: )"}]
[null,"Project Address",{"$f":"CONCATENATE(IF(Type=\"Batch\",Instructions!F72,Instructions!Y109))","v":", ,  , "}]
[null,{"$f":"IF(Instructions!F19=\"Batch\",\"***Please see 'Batch - Single Family' tab for address information\",\"\")","v":""}]
[null,"Note: The information on this tab is READ-ONLY.  To edit this information, see the Credit Category tabs."]
[]
[null,null,"Integrative Process",null,"Preliminary    Y",{"$f":"IP!F3","v":0},"M",{"$f":"IP!H3","v":0},"Verified",{"$f":"IP!J3","v":0}]
{"$rows_left_out":97}
{"sheet":"Scorecard (Midrise)","index":2,"n_rows":93,"n_cols":12,"rows_kept":93,"cut":false,"hidden":true,"merged":[[92,1,92,9],[14,11,15,11],[33,11,34,11]]}
[]
[null,"LEED BD+C: Multifamily Midrise v4 - LEED v4"]
[null,{"$f":"CONCATENATE(IF(Type=\"Batch\",Instructions!F71,Instructions!F57),\" Scorecard\")","v":" Scorecard"}]
[null,"Location:",{"$f":"CONCATENATE(IF(Type=\"Batch\",Instructions!F72,Instructions!Y109))","v":", ,  , "}]
[null,"Note: The information on this tab is READ-ONLY.  To edit this information, see the Credit Category tabs."]
[]
[null,null,"Integrative Process",null,"Preliminary    Y",{"$f":"IP!F3","v":0},"M",{"$f":"IP!H3","v":0},"Verified",{"$f":"IP!J3","v":0}]
[]
{"$rows_left_out":86}
{"sheet":"Batch - Multifamily","index":3,"n_rows":23,"n_cols":12,"rows_kept":23,"cut":false,"hidden":true,"merged":[[6,1,6,11],[12,9,12,10],[7,1,7,5],[8,1,8,5],[9,1,9,5],[12,1,12,7]]}
[]
[null,"Certification Submittal for Batches of Multifamily Buildings"]
[null,{"$f":"CONCATENATE(\"Batch Registration Set ID #\",Instructions!F70)","v":"Batch Registration Set ID #"}]
[null,{"$f":"CONCATENATE(\"Building type: \",Instructions!F73)","v":"Building type: "}]
[]
[]
[null,"The following is a list of homes to be submitted for certification as a batch. As per LEED for Homes guidelines, every building in this batch submittal will meet or exceed the performance requirements for every prerequisite and credit awarded on the project checklist. "]
[null,"Total number of buildings ",null,null,null,null,{"$f":"COUNTA(C15:C22)","v":0}]
{"$rows_left_out":16}
{"sheet":"Multifamily HSA","index":4,"n_rows":14,"n_cols":16,"rows_kept":14,"cut":false,"hidden":true,"merged":[[10,14,10,15],[4,1,4,15],[6,1,7,1],[6,2,6,3],[6,4,6,5],[6,6,6,7],[6,8,6,9],[6,10,6,11],[6,12,6,13],[6,14,6,15],[13,1,13,14],[12,1,12,14],[9,14,9,15],[9,2,9,3],[9,4,9,5],[9,6,9,7],[9,8,9,9],[9,10,9,11],[9,12,9,13],[11,1,11,14],[10,4,10,5],[10,6,10,7],[10,2,10,3],[10,8,10,9],[10,10,10,11],[10,12,10,13]]}
[]
[null,"Multifamily Home Size Adjuster"]
[]
[]
[null,"This approach can be used to determine an overall home size adjuster for multifamily buildings. \n\nInput the number of units and the average square footage for units with the corresponding bedroom number. For example, if the building has three 2-bedroom units that are 1300 sq ft, 1400 sq ft, and 1500 sq ft, insert \"3\" in cell G9 and \"1400\" in cell H9. Please leave zeroes or blanks where appropriate.\n\nThis approach can also be used to determine an overall home size adjuster for a complex with multiple residential buildings.  If a project includes multiple residential buildings, add all the buildings together like it’s a single-mega structure. For example, if building A has four 2-bedroom units and building B has six 2-bedroom units, insert “10” in cell G9. Average the square footage for all units in the complex with the corresponding bedroom quantity."]
[]
[null,"Building ID","0 Bedrooms",null,"1 Bedroom",null,"2 Bedrooms",null,"3 Bedrooms",null,"4 Bedrooms",null,"5 Bedrooms",null,"6 Bedrooms"]
[null,null,"Number \nof Units",{"$f":"CONCATENATE(\"Average \nFloor Area\n\",IF(Instructions!$I$85=1,\" (sq ft)\",\" (sq m)\"))","v":"Average \nFloor Area\n (sq ft)"},"Number \nof Units",{"$f":"CONCATENATE(\"Average \nFloor Area\n\",IF(Instructions!$I$85=1,\" (sq ft)\",\" (sq m)\"))","v":"Average \nFloor Area\n (sq ft)"},"Number \nof Units",{"$f":"CONCATENATE(\"Average \nFloor Area\n\",IF(Instructions!$I$85=1,\" (sq ft)\",\" (sq m)\"))","v":"Average \nFloor Area\n (sq ft)"},"Number \nof Units",{"$f":"CONCATENATE(\"Average \nFloor Area\n\",IF(Instructions!$I$85=1,\" (sq ft)\",\" (sq m)\"))","v":"Average \nFloor Area\n (sq ft)"},"Number \nof Units",{"$f":"CONCATENATE(\"Average \nFloor Area\n\",IF(Instructions!$I$85=1,\" (sq ft)\",\" (sq m)\"))","v":"Average \nFloor Area\n (sq ft)"},"Number \nof Units",{"$f":"CONCATENATE(\"Average \nFloor Area\n\",IF(Instructions!$I$85=1,\" (sq ft)\",\" (sq m)\"))","v":"Average \nFloor Area\n (sq ft)"},"Number \nof Units",{"$f":"CONCATENATE(\"Average \nFloor Area\n\",IF(Instructions!$I$85=1,\" (sq ft)\",\" (sq m)\"))","v":"Average \nFloor Area\n (sq ft)"}]
{"$rows_left_out":7}
{"sheet":"Batch - Single Family","index":5,"n_rows":28,"n_cols":18,"rows_kept":28,"cut":false,"hidden":false,"merged":[[13,11,13,17],[6,1,6,8],[7,1,7,5],[8,1,8,5],[9,1,9,5],[10,1,10,5],[13,1,13,6],[13,7,13,10]]}
[]
[null,"Certification Submittal for Batches of Single Family Homes"]
[null,{"$f":"CONCATENATE(\"Batch Registration Set ID #\",Instructions!F70)","v":"Batch Registration Set ID #"}]
[null,{"$f":"CONCATENATE(\"Building type: \",Instructions!F73)","v":"Building type: "}]
[]
[]
[null,"The following is a list of homes to be submitted for certification as a batch. As per LEED for Homes guidelines, every home in this batch submittal will meet or exceed the performance requirements for every prerequisite and credit awarded on the project checklist. "]
[null,"Total number of homes",null,null,null,null,{"$f":"COUNTA(C16:C26)","v":0}]
{"$rows_left_out":21}
{"sheet":"IP","index":6,"n_rows":49,"n_cols":17,"rows_kept":49,"cut":false,"hidden":false,"merged":[[44,3,45,9],[20,3,26,9],[20,15,21,15],[4,1,4,3],[35,15,36,15],[13,3,18,9],[28,3,29,9],[35,3,36,9]]}
[null,"Integrative Process",null,null,null,null,null,null,null,null,null,"Notes","Verified \n(initials)","Date \nVerified","QAD Notes","Verification Measure","QAD Notes"]
[]
[null,null,null,null,"Preliminary    Y",{"$f":"F7","v":0},"Maybe",{"$f":"H7","v":0},"Verified",{"$f":"J7","v":0}]
[]
["IPc1",{"$f":"L5","v":"IP Credit Integrative Process"},null,null,null,null,null,null,null,null,"HM","IP Credit Integrative Process"]
[null,null,null,null,null,null,null,null,null,null,"HM"]
[null,"Up to 2 points",null,null,"Preliminary    Y",{"$f":"IF(SUM(F11,F33,F42)>2,2,SUM(F11,F33,F42))","v":0},"M",{"$f":"IF(SUM(H11,H33,H42)>2,2,SUM(H11,H33,H42))","v":0},"Verified",{"$f":"IF(SUM(J11,J33,J42)>2,2,SUM(J11,J33,J42))","v":0},"HM",null,"Responsible Party"]
[null,"Exemplary Performance: Achieve all three options",null,null,null,null,null,null,null,null,"HM"]
{"$rows_left_out":42}
{"sheet":"LT","index":7,"n_rows":137,"n_cols":17,"rows_kept":137,"cut":false,"hidden":false,"merged":[[4,1,4,3],[16,1,16,3],[29,1,29,3],[108,1,108,3],[42,3,42,5],[43,3,43,5],[64,3,64,8],[81,3,81,5],[54,3,54,9],[67,3,67,5],[50,3,50,9],[52,3,52,9],[56,3,56,9],[58,3,58,9],[21,2,21,3],[23,2,23,3],[25,2,25,3],[27,2,27,3],[41,3,41,5],[134,3,134,5],[135,3,135,5],[125,3,125,5],[115,3,115,5],[116,3,116,5],[117,3,117,5],[127,1,127,3],[119,1,119,3],[114,3,114,5]]}
[null,"Location and Transportation",null,null,null,null,null,null,null,null,null,"Notes","Verified \n(initials)","Date \nVerified","QAD Notes","Verification Measure","QAD Notes"]
[]
[null,null,null,null,"Preliminary    Y",{"$f":"IF(LT!$F$19=10,10,SUM(F32,F111,F122,F130))","v":0},"Maybe",{"$f":"IF(H19=10,10,SUM(H19,H32,H111,H122,H130))","v":0},"Verified",{"$f":"IF(J19=10,10,SUM(J19,J32,J111,J122,J130))","v":0}]
[]
["LTp1",{"$f":"L5","v":"LT Prerequisite Floodplain Avoidance"},null,null,null,null,null,null,null,null,"HM","LT Prerequisite Floodplain Avoidance"]
[null,null,null,null,null,null,null,null,null,null,"HM"]
[null,"Required",null,null,null,"Required",null,null,"Verified","N","HM",null,"Responsible Party"]
[null,null,null,null,null,null,null,null,null,null,"HM"]
{"$rows_left_out":130}
{"sheet":"SS","index":8,"n_rows":160,"n_cols":17,"rows_kept":160,"cut":false,"hidden":false,"merged":[[4,1,4,3],[31,1,31,3],[63,1,63,3],[119,1,119,3],[10,3,10,8],[12,3,12,8],[16,3,16,8],[14,3,14,9],[48,3,48,8],[49,3,49,8],[54,3,54,8],[42,3,42,8],[51,3,51,8],[45,3,45,8],[91,3,91,7],[94,3,94,7],[158,3,159,9],[18,3,19,9],[25,3,26,9],[28,3,29,9],[130,3,131,9],[135,3,136,9],[102,3,102,7],[126,3,126,8],[128,3,128,8],[96,3,96,7],[50,3,50,8],[21,3,21,8],[155,3,155,9],[152,3,153,9],[148,3,150,9],[145,3,146,9],[133,3,133,8],[138,3,138,8],[143,3,143,8],[140,3,141,9],[95,3,95,7],[66,1,66,9],[78,3,78,7],[79,3,79,7],[41,3,41,8],[43,3,43,8],[44,3,44,8],[74,3,74,7],[77,3,77,7],[87,3,87,7],[88,3,88,7],[80,3,80,7],[83,3,83,7],[84,3,84,7],[85,3,85,7],[86,3,86,7]]}
[null,"Sustainable Sites",null,null,null,null,null,null,null,null,null,"Notes","Verified \n(initials)","Date \nVerified","QAD Notes","Verification Measure","QAD Notes"]
[]
[null,null,null,null,"Preliminary    Y",{"$f":"SUM(F34,F66,F122)","v":0},"Maybe",{"$f":"SUM(H34,H66,H122)","v":0},"Verified",{"$f":"SUM(J34,J66,J122)","v":0}]
[]
["SSp1",{"$f":"L5","v":"SS Prerequisite Construction Activity Pollution Prevention "},null,null,null,null,null,null,null,null,"HM","SS Prerequisite Construction Activity Pollution Prevention "]
[null,null,null,null,null,null,null,null,null,null,"HM"]
[null,"Required",null,null,null,"Required",null,null,"Verified","N","HM",null,"Responsible Party"]
[null,null,null,null,null,null,null,null,null,null,"HM"]
{"$rows_left_out":153}
{"sheet":"WE","index":9,"n_rows":86,"n_cols":17,"rows_kept":86,"cut":false,"hidden":false,"merged":[[53,3,53,7],[56,3,56,7],[57,3,57,7],[60,3,60,7],[62,1,62,3],[48,3,48,7],[49,3,49,7],[52,3,52,7],[4,1,4,3],[12,3,12,8],[18,3,18,8],[35,3,35,8],[45,3,45,8],[37,3,38,9],[20,1,20,3],[29,1,29,3],[40,1,40,3]]}
[null,"Water Efficiency",null,null,null,null,null,null,null,null,null,"Notes","Verified \n(initials)","Date \nVerified","QAD Notes","Verification Measure","QAD Notes"]
[]
[null,null,null,null,"Preliminary    Y",{"$f":"IF(WE!$F$32>0,WE!$F$32,SUM(F43,F65))","v":0},"Maybe",{"$f":"IF(WE!$H$32>0,WE!$H$32,SUM(H43,H65))","v":0},"Verified",{"$f":"IF(WE!$J$32>0,WE!$J$32,SUM(J43,J65))","v":0}]
[]
["WEp1",{"$f":"L5","v":"WE Prerequisite Water Use"},null,null,null,null,null,null,null,null,"HM","WE Prerequisite Water Use"]
[]
[null,"Required",null,null,null,"Required",null,null,"Verified",{"$f":"IF(OR(C13=0.2,C13>0.2,C19=3,C19>3),\"Y\",\"N\")","v":"N"},null,null,"Responsible Party"]
[]
{"$rows_left_out":79}
{"sheet":"EA","index":10,"n_rows":190,"n_cols":17,"rows_kept":190,"cut":false,"hidden":false,"merged":[[178,1,178,9],[168,2,168,3],[170,2,170,3],[172,2,172,7],[173,2,173,8],[163,1,163,3],[113,3,113,8],[92,3,92,8],[96,3,98,9],[41,3,42,9],[141,2,142,3],[94,3,94,9],[149,2,150,3],[55,3,55,7],[100,3,101,9],[111,3,112,9],[83,1,83,3],[126,3,126,8],[128,3,128,9],[130,3,132,9],[134,3,135,9],[4,1,4,3],[27,1,27,3],[36,1,36,3],[45,1,45,3],[54,3,54,7],[11,3,11,7],[13,3,13,7],[14,3,14,7],[43,3,43,8],[19,3,19,7],[20,3,20,7],[21,3,21,7],[25,3,25,7]]}
[null,"Energy and Atmosphere",null,null,null,null,null,null,null,null,null,"Notes","Verified \n(initials)","Date \nVerified","QAD Notes","Verification Measure","QAD Notes"]
[]
[null,null,null,null,"Preliminary    Y",{"$f":"SUM(F48,F86,F166,F178)","v":0},"Maybe",{"$f":"SUM(H48,H86,H166,H178)","v":0},"Verified",{"$f":"SUM(J48,J86,J166,J178)","v":0}]
[]
["EAp1",{"$f":"L5","v":"EA Prerequisite Minimum Energy Performance"},null,null,null,null,null,null,null,null,"HM","EA Prerequisite Minimum Energy Performance"]
[null,null,null,null,null,null,null,null,null,null,"HM"]
[null,"Required",null,null,null,"Required",null,null,"Verified","N","HM",null,"Responsible Party"]
[null,null,null,null,null,null,null,null,null,null,"HM"]
{"$rows_left_out":183}
{"sheet":"EA Lowrise","index":11,"n_rows":1002,"n_cols":18,"rows_kept":1002,"cut":false,"hidden":true,"merged":[]}
["HERS index","Points",null,"Percentage reduction","Floor","Points",null,"Annual Energy Use Option 1 Percentage","Annual Energy Use Option 1 Points",null,"Points below HERS Index Target (SAF Adjusted)","Points",null,"HERS Index","Points",null,"HERS Index","Points"]
[0,29,null,0,{"$f":"FLOOR(D2,0.001)","v":0},0,null,0.01,1,null,0,10,null,70,10,null,84,1]
[1,28,null,1E-3,{"$f":"FLOOR(D3,0.001)","v":1E-3},0,null,0.02,2,null,1,11,null,69,11,null,83,1]
[2,28,null,2E-3,2E-3,0,null,0.03,3,null,2,12,null,68,12,null,82,2]
[3,28,null,3.0000000000000001E-3,3.0000000000000001E-3,0,null,0.04,4,null,3,13,null,67,13,null,81,2]
[4,28,null,4.0000000000000001E-3,4.0000000000000001E-3,0,null,0.05,5,null,4,14,null,66,14,null,80,3]
[5,28,null,5.0000000000000001E-3,5.0000000000000001E-3,0,null,0.06,6,null,5,15,null,65,15,null,79,3]
[6,27,null,6.0000000000000001E-3,6.0000000000000001E-3,0,null,7.0000000000000007E-2,7,null,6,16,null,64,16,null,78,4]
{"$rows_left_out":995}
{"sheet":"EA Midrise","index":12,"n_rows":992,"n_cols":3,"rows_kept":992,"cut":false,"hidden":true,"merged":[]}
["Percentage reduction","Floor","Points"]
[0.01,{"$f":"FLOOR(A2,0.001)","v":0.01},0]
[1.0999999999999999E-2,{"$f":"FLOOR(A3,0.001)","v":1.0999999999999999E-2},0]
[1.2E-2,1.2E-2,0]
[1.2999999999999999E-2,1.3000000000000001E-2,0]
[1.4E-2,1.4E-2,0]
[1.4999999999999999E-2,1.4999999999999999E-2,0]
[1.6E-2,1.6E-2,0]
{"$rows_left_out":985}
{"sheet":"MR","index":13,"n_rows":170,"n_cols":17,"rows_kept":170,"cut":false,"hidden":false,"merged":[[90,3,90,6],[148,1,148,3],[110,2,111,2],[102,3,102,6],[103,3,103,6],[93,2,94,2],[93,3,93,6],[94,3,94,6],[95,2,96,2],[95,3,95,6],[96,3,96,6],[115,1,115,3],[100,2,100,7],[95,7,96,7],[97,7,98,7],[102,7,103,7],[93,7,94,7],[112,3,112,6],[113,3,113,6],[97,2,98,2],[97,3,97,6],[98,3,98,6],[102,2,103,2],[4,1,4,3],[11,1,11,3],[36,1,36,3],[63,1,63,3],[110,3,110,6],[26,3,27,9],[110,7,111,7],[104,7,105,7],[106,7,107,7],[83,7,84,7],[85,7,86,7],[87,7,88,7],[89,7,90,7],[91,7,92,7],[89,2,90,2],[89,3,89,6],[9,3,9,9],[155,3,155,8],[156,3,156,8],[141,3,141,6],[143,3,143,6],[144,3,144,6],[145,3,145,6],[146,3,146,6],[109,3,109,6],[82,3,82,6],[24,3,24,8],[32,3,32,8],[19,3,20,9],[22,3,22,9],[112,7,113,7],[108,7,109,7],[16,3,16,8],[44,3,45,9],[83,2,84,2],[85,2,86,2],[87,2,88,2],[87,3,87,6],[88,3,88,6],[83,3,83,6],[84,3,84,6],[85,3,85,6],[86,3,86,6],[73,3,73,6],[29,3,30,9],[34,3,34,8],[91,2,92,2],[91,3,91,6],[92,3,92,6],[44,15,46,15],[159,3,159,8],[104,2,105,2],[104,3,104,6],[105,3,105,6],[106,2,107,2],[106,3,106,6],[107,3,107,6],[108,2,109,2],[108,3,108,6],[157,3,158,9],[111,3,111,6],[112,2,113,2],[169,3,169,6],[162,3,162,6],[163,3,163,6],[164,3,164,6],[167,3,167,6],[168,3,168,6]]}
[null,"Materials and Resources",null,null,null,null,null,null,null,null,null,"Notes","Verified \n(initials)","Date \nVerified","QAD Notes","Verification Measure","QAD Notes"]
[]
[null,null,null,null,"Preliminary    Y",{"$f":"SUM(F39,F66,F151,F118)","v":0},"Maybe",{"$f":"SUM(H39,H66,H151,H118)","v":0},"Verified",{"$f":"SUM(J39,J66,J151,J118)","v":0}]
[]
["MRp1",{"$f":"L5","v":"MR Prerequisite Certified Tropical Wood"},null,null,null,null,null,null,null,null,"HM","MR Prerequisite Certified Tropical Wood"]
[null,null,null,null,null,null,null,null,null,null,"HM"]
[null,"Required",null,null,null,"Required",null,null,"Verified","N","HM",null,"Responsible Party"]
[null,null,null,null,null,null,null,null,null,null,"HM"]
{"$rows_left_out":163}
{"sheet":"EQ","index":14,"n_rows":362,"n_cols":17,"rows_kept":362,"cut":false,"hidden":false,"merged":[[360,3,360,8],[361,3,361,8],[20,3,20,8],[345,3,345,8],[57,3,57,7],[113,3,113,7],[58,3,58,7],[61,3,61,7],[64,3,64,7],[358,3,358,8],[334,1,334,3],[343,3,343,8],[265,3,265,8],[355,3,355,8],[356,3,356,9],[251,3,251,8],[128,15,129,15],[116,1,116,3],[132,1,132,3],[157,1,157,3],[253,1,253,3],[124,3,124,7],[126,3,126,7],[141,2,141,3],[122,3,122,8],[141,4,142,9],[150,3,150,7],[175,3,175,7],[196,3,196,7],[190,3,190,8],[247,3,247,7],[249,3,249,9],[4,1,4,3],[29,1,29,3],[50,1,50,3],[70,1,70,3],[106,1,106,3],[90,3,90,9],[88,3,88,7],[13,3,14,9],[89,3,89,7],[66,3,66,7],[68,3,68,7],[40,3,40,7],[44,3,44,7],[46,3,46,7],[27,3,27,9],[48,3,48,7],[16,3,16,8],[18,3,18,8],[188,3,188,7],[114,3,114,7],[147,3,148,9],[166,3,167,9],[85,3,85,7],[36,3,36,7],[37,3,37,7],[169,3,169,9],[92,3,93,9],[177,3,177,7],[185,3,185,7],[99,3,99,7],[102,3,102,7],[104,3,104,7],[267,3,268,9],[348,3,348,7],[353,3,353,7],[272,2,272,7],[341,2,341,9],[350,3,350,8],[346,3,346,8],[351,3,351,8]]}
[null,"Indoor Environmental Quality",null,null,null,null,null,null,null,null,null,"Notes","Verified \n(initials)","Date \nVerified","QAD Notes","Verification Measure","QAD \nVerification Notes"]
[]
[null,null,null,null,"Preliminary    Y",{"$f":"SUM(F337,F256,F160,F135)","v":0},"Maybe",{"$f":"SUM(H337,H256,H160,H135)","v":0},"Verified",{"$f":"SUM(J337,J256,J160,J135)","v":0}]
[]
["EQp1",{"$f":"L5","v":"EQ Prerequisite Ventilation"},null,null,null,null,null,null,null,null,"HM","EQ Prerequisite Ventilation"]
[null,null,null,null,null,null,null,null,null,null,"HM"]
[null,"Required",null,null,null,"Required",null,null,"Verified",{"$f":"IF(OR(J10=\"Y\",J12=\"Y\"),\"Y\",\"N\")","v":"N"},"HM",null,"Responsible Party"]
[null,null,null,null,null,null,null,null,null,null,"HM"]
{"$rows_left_out":355}
{"sheet":"IN","index":15,"n_rows":52,"n_cols":17,"rows_kept":52,"cut":false,"hidden":false,"merged":[[4,1,4,3],[11,1,11,3],[46,1,46,3],[21,2,21,4],[20,2,20,4],[13,1,13,9],[51,2,51,4],[27,2,27,4],[35,2,35,4],[34,2,34,4],[43,2,43,4],[44,2,44,4],[40,2,40,4],[41,2,41,4],[37,2,37,4],[38,2,38,4]]}
[null,"Innovation",null,null,null,null,null,null,null,null,null,"Notes","Verified \n(initials)","Date \nVerified","QAD Notes","Verification Measure","QAD \nVerification Notes"]
[]
[null,null,null,null,"Preliminary    Y",{"$f":"SUM(F15,F49)","v":0},"Maybe",{"$f":"SUM(H15,H49)","v":0},"Verified",{"$f":"SUM(J15,J49)","v":0}]
[]
["INp1",{"$f":"L5","v":"IN Prerequisite Preliminary Rating"},null,null,null,null,null,null,null,null,"HM","IN Prerequisite Preliminary Rating"]
[null,null,null,null,null,null,null,null,null,null,"HM"]
[null,"Required",null,null,null,"Required",null,null,"Verified","N","HM",null,"Responsible Party"]
[null,null,null,null,null,null,null,null,null,null,"HM"]
{"$rows_left_out":45}
{"sheet":"RP","index":16,"n_rows":19,"n_cols":17,"rows_kept":19,"cut":false,"hidden":false,"merged":[[4,1,4,3],[9,2,9,9],[17,2,17,3],[18,2,18,3],[14,2,14,3],[15,2,15,3],[10,2,10,3],[11,2,11,3],[12,2,12,3],[13,2,13,3],[16,2,16,3]]}
[null,"Regional Priority",null,null,null,null,null,null,null,null,null,"Notes","Verified \n(initials)","Date \nVerified","QAD Notes","Verification Measure","QAD \nVerification Notes"]
[]
[null,null,null,null,"Preliminary    Y",{"$f":"F7","v":0},"Maybe",{"$f":"H7","v":0},"Verified",{"$f":"J7","v":0}]
[]
["RPc1",{"$f":"L5","v":"RP Credit Regional Priority"},null,null,null,null,null,null,null,null,"HM","RP Credit Regional Priority"]
[null,null,null,null,null,null,null,null,null,null,"HM"]
[null,"Up to 4 points",null,null,"Preliminary    Y",0,"M",0,"Verified",0,"HM",null,"Responsible Party"]
[null,null,null,null,null,null,null,null,null,null,"HM"]
{"$rows_left_out":12}
{"sheet":"Water Reduction Calculator","index":17,"n_rows":150,"n_cols":23,"rows_kept":150,"cut":false,"hidden":false,"merged":[[132,1,132,5],[127,1,127,5],[128,1,128,5],[129,1,129,5],[130,1,130,5],[131,1,131,5],[96,1,96,4],[143,9,143,10],[143,5,143,8],[143,1,144,1],[143,2,144,4],[144,7,144,8],[144,5,144,6],[136,1,136,5],[137,1,137,5],[138,1,138,5],[139,1,139,5],[140,1,140,7],[115,1,115,4],[116,1,117,1],[116,2,117,2],[116,4,117,4],[108,1,108,2],[116,3,117,3],[54,21,55,21],[54,4,55,4],[54,18,55,18],[54,17,55,17],[4,1,4,8],[9,1,9,7],[10,1,10,7],[8,1,8,7],[35,1,35,4],[54,2,55,2],[13,1,13,3],[25,1,25,3],[27,1,27,2],[34,1,34,4],[36,21,37,21],[36,4,37,4],[36,14,37,14],[36,15,37,15],[36,16,37,16],[36,17,37,17],[36,18,37,18],[36,19,37,19],[36,5,36,6],[7,1,7,8],[97,1,98,1],[97,2,98,2],[97,4,98,4],[97,3,98,3],[78,1,79,1],[78,2,79,2],[89,1,89,2],[36,13,37,13],[77,1,77,4],[54,1,55,1],[78,3,79,3],[54,3,55,3],[36,2,37,2],[36,7,36,8],[36,9,36,10],[36,11,36,12],[78,21,79,21],[78,4,79,4],[66,1,66,4],[116,18,117,18],[116,19,117,19],[35,18,35,19],[35,15,35,17],[53,1,53,4],[53,5,53,14],[54,5,54,6],[54,7,54,8],[54,9,54,10],[54,11,54,12],[54,13,55,13],[53,15,53,17],[53,18,53,19],[36,1,37,1],[36,3,37,3],[96,15,96,17],[96,18,96,19],[97,18,98,18],[97,19,98,19],[97,15,98,15],[97,16,98,16],[97,21,98,21],[97,17,98,17],[97,13,98,13],[97,14,98,14],[97,5,97,6],[97,7,97,8],[97,9,97,10],[97,11,97,12],[116,21,117,21],[115,15,115,17],[116,5,116,6],[116,7,116,8],[116,9,116,10],[116,11,116,12],[116,15,117,15],[116,16,117,16],[116,17,117,17],[116,13,117,13],[116,14,117,14],[115,18,115,19],[54,16,55,16],[54,19,55,19],[54,15,55,15],[54,14,55,14],[78,14,79,14],[78,15,79,15],[78,5,78,6],[78,7,78,8],[78,9,78,10],[78,11,78,12],[78,13,79,13],[77,15,77,17],[78,19,79,19],[78,16,79,16],[78,17,79,17],[78,18,79,18],[77,18,77,19]]}
[]
[null,"Water Reduction Calculator"]
[]
[]
[null,"Use this calculator to determine if your building uses less water than the requirements of  WE Credit Total Water Use.\n\nNote:  This calculator is a relative measure of water use based on how the products are designed and not how they actually perform in the field.  Therefore, please use values/rates from the product specifications.  Measurements from field testing should NOT be used in this calculator, but may be used to identify improperly installed or malfunctioning products.  "]
[]
[null,"Outdoor Water Use"]
[null,"Provide the following values from the WaterSense Water Budget Calculator. Note that you should enter the ‘Baseline’ water use, not the Landscape Water Allowance. The landscape water allowance is by definition 70% of the baseline water use."]
{"$rows_left_out":143}
{"sheet":"Sampling Reporting Form","index":18,"n_rows":22,"n_cols":13,"rows_kept":22,"cut":false,"hidden":false,"merged":[[4,6,5,6],[4,7,4,9],[4,12,5,12],[4,10,4,11],[4,1,5,1],[4,2,5,2],[4,3,5,3],[4,4,5,4],[4,5,5,5]]}
[]
[null,"Sampling Reporting Form"]
[]
[]
[null,"Sample Set","Size of\nSample Set\n(Number of Lots/Units)","Lot/Unit Numbers \nwithin \nSample Set","Sampling \nRate\n(%)","Number of \nUnits or Buildings Verified","Lot/Unit Numbers\nVerified","On-site Verification",null,null,"Failures",null,"Notes"]
[null,null,null,null,null,null,null,"Pre-Slab\nVerification Date","Pre-Drywall\nVerification Date","Final\nVerification Date","Lot/Unit Number \nof any Failures","Remediation Activity\nfor Failure"]
[{"$f":"IF(B7=1,0,0)","v":0},1]
[{"$f":"IF(B8=1,0,0)","v":0},2]
{"$rows_left_out":15}
{"sheet":"MRc Construction Waste Mgmt","index":19,"n_rows":17,"n_cols":3,"rows_kept":17,"cut":false,"hidden":true,"merged":[]}
["Bedrooms","Conditioned Floor Area (SF)","Waste (LBS)"]
[0,1000,4200]
[1,1000,4200]
[2,1600,6720]
[3,2200,9240]
[4,2800,11760]
[5,3400,14280]
[6,4000,16800]
{"$rows_left_out":10}
{"sheet":"Scorecard Data","index":20,"n_rows":619,"n_cols":17,"rows_kept":619,"cut":false,"hidden":true,"merged":[]}
["Project ID #",{"$f":"Instructions!F56","v":0}]
["Units",{"$f":"Instructions!F12","v":0}]
["Rating System",{"$f":"Instructions!F15","v":"LEED BD+C: Homes  v4.1 - LEED v4"}]
["Building type",{"$f":"IF(Type=\"Batch\",Instructions!F73,Instructions!F63)","v":0}]
["Project name",{"$f":"Instructions!F57","v":0}]
["Project address",{"$f":"Instructions!F58","v":0}]
["City",{"$f":"Instructions!F59","v":0}]
["State",{"$f":"Instructions!F60","v":0}]
{"$rows_left_out":611}